{"text_format":"1","workbook":"xlsx","n_sheets":21,"sheets":["Table of Contents","Property Tax Impact Static","Property Tax Impact Value Chg","Property Tax Impact Val Chg 2","Specific LLC Information","Scott Co Prelim Data","720","Tax Calculator","RMV History","NTC History","District","Ag2School Tax Impact","2017 Neighbor Comparison Graph","2017 Neighbor Comp Ag Graph","Disclosure","Page 1","Page 2 Top","Page 2 Middle","Page 2 Bottom","Page 2 OPEB","Counties"],"not_rendered":{"charts":4,"images":3,"macros":1,"external_links":0,"defined_names":71,"comments":1,"pivot_tables":0},"unopened":[],"bounds":{"document_bytes":16777216,"sheet_cells":100000,"rows_first":2000,"rows_last":500,"rows_between":2000,"halvings":0,"cell_chars":16384,"cell_head_chars":4096},"cells_cut":0,"cells_raw":0,"read":"whole","date_system":"1900"}

{"sheet":"Table of Contents","index":0,"n_rows":25,"n_cols":14,"rows_kept":25,"cut":false,"hidden":false,"merged":[]}
[{"$f":"CONCATENATE(\"Independent School District \",District!A7,\" - \",District!B7)","v":"Independent School District 720 - Shakopee Public School District"}]
[{"$f":"'Specific LLC Information'!A3","v":"LLC Updated 10-02-17 Worksheet Update 10-30-17"}]
[]
[]
[]
[null,"Tab Name","Notes"]
[]
[null,"Table of Contents"]
{"$rows_left_out":18}
{"sheet":"Property Tax Impact Static","index":1,"n_rows":23,"n_cols":32,"rows_kept":23,"cut":false,"hidden":false,"merged":[[5,16,5,23],[5,24,5,31],[7,1,15,1],[18,1,26,1],[29,1,37,1]]}
[{"$f":"'Specific LLC Information'!A1","v":"Independent School District 720 - Shakopee Public School District"}]
["Information for TnT Presentation - No Change in Valuation"]
[]
[]
[]
[null,null,null,null,null,null,null,null,null,null,null,null,null,null,null,null,"Pay 2017 MV Exclusion",null,null,null,null,null,null,null,"Pay 2018 MV Exclusion"]
[null,"Type of Property","2016 Estimated Market Value","Actual Pay 2017 School Portion of Taxes","2017 Estimated Market Value","Est. Pay 2018 School Portion of Taxes",null,"Estimated Tax Increase / (Decrease)","Estimated Percent Change",null,null,null,"Pay 2017 NTC of Properties to the left","Pay 2018 NTC of Properties to the left","Chk Figure",null,"Market Value",null,null,null,null,null,null,"MV Exclusion","Market Value",null,null,null,null,null,null,"MV Exclusion"]
[null,"Residential Homestead",100000,{"$f":"(C8*$M$19)+(M8*$M$20)","v":468.61475999999999},{"$f":"C8","v":100000},{"$f":"(E8*$M$22)+(N8*$M$23)","v":502.46868000000006},null,{"$f":"F8-D8","v":33.853920000000073},{"$f":"H8/D8","v":7.224253883936578E-2},null,null,null,{"$f":"ROUND((0.01*MIN(500000,C8)+0.0125*MAX(C8-500000,0))-X8,0)","v":718},{"$f":"ROUND((0.01*MIN(500000,E8)+0.0125*MAX(E8-500000,0))-AF8,0)","v":718},{"$f":"H8-'Tax Calculator'!N52","v":-19.142899999999941},null,{"$f":"C8","v":100000},0.4,{"$f":"MIN(Q8*R8,30400)","v":30400},{"$f":"IF(Q8>76000,Q8-76000,0)","v":24000},0.09,{"$f":"T8*U8","v":2160},{"$f":"MAX(S8-V8,0)","v":28240},{"$f":"ROUND((0.01*MIN(500000,W8)+0.0125*MAX(W8-500000,0)), 0)","v":282},{"$f":"E8","v":100000},0.4,{"$f":"MIN(Y8*Z8,30400)","v":30400},{"$f":"IF(Y8>76000,Y8-76000,0)","v":24000},0.09,{"$f":"AB8*AC8","v":2160},{"$f":"MAX(AA8-AD8,0)","v":28240},{"$f":"ROUND((0.01*MIN(500000,AE8)+0.0125*MAX(AE8-500000,0)), 0)","v":282}]
{"$rows_left_out":16}
{"sheet":"Property Tax Impact Value Chg","index":2,"n_rows":23,"n_cols":32,"rows_kept":23,"cut":false,"hidden":false,"merged":[[5,16,5,23],[5,24,5,31],[7,1,15,1],[18,1,26,1],[29,1,37,1]]}
[{"$f":"'Specific LLC Information'!A1","v":"Independent School District 720 - Shakopee Public School District"}]
[{"$f":"CONCATENATE(\"Information for TnT Presentation - \",TEXT(M2,\"0.00%\"),\" change in Assessed Valuation\")","v":"Information for TnT Presentation - 2.75% change in Assessed Valuation"},null,null,null,null,null,null,null,null,null,null,null,{"$f":"'Tax Calculator'!L8","v":2.75E-2},"Enter Change in Valuation (Title to left will automatically update)"]
[]
[]
[]
[null,null,null,null,null,null,null,null,null,null,null,null,null,null,null,null,"Pay 2017 MV Exclusion",null,null,null,null,null,null,null,"Pay 2018 MV Exclusion"]
[null,"Type of Property","2016 Estimated Market Value","Actual Pay 2017 School Portion of Taxes","2017 Estimated Market Value","Est. Pay 2018 School Portion of Taxes",null,"Estimated Tax Increase / (Decrease)","Estimated Percent Change",null,null,null,"Pay 2017 NTC of Properties to the left","Pay 2018 NTC of Properties to the left","Chk Figure",null,"Market Value",null,null,null,null,null,null,"MV Exclusion","Market Value",null,null,null,null,null,null,"MV Exclusion"]
[null,"Residential Homestead",100000,{"$f":"(C8*$M$19)+(M8*$M$20)","v":468.61475999999999},{"$f":"C8*(1+$M$2)","v":102750.00000000001},{"$f":"(E8*$M$22)+(N8*$M$23)","v":521.61158},null,{"$f":"F8-D8","v":52.996820000000014},{"$f":"H8/D8","v":0.11309251121326186},null,null,null,{"$f":"ROUND((0.01*MIN(500000,C8)+0.0125*MAX(C8-500000,0))-X8,0)","v":718},{"$f":"ROUND((0.01*MIN(500000,E8)+0.0125*MAX(E8-500000,0))-AF8,0)","v":748},{"$f":"H8-'Tax Calculator'!N52","v":0},null,{"$f":"C8","v":100000},0.4,{"$f":"MIN(Q8*R8,30400)","v":30400},{"$f":"IF(Q8>76000,Q8-76000,0)","v":24000},0.09,{"$f":"T8*U8","v":2160},{"$f":"MAX(S8-V8,0)","v":28240},{"$f":"ROUND((0.01*MIN(500000,W8)+0.0125*MAX(W8-500000,0)), 0)","v":282},{"$f":"E8","v":102750.00000000001},0.4,{"$f":"MIN(Y8*Z8,30400)","v":30400},{"$f":"IF(Y8>76000,Y8-76000,0)","v":26750.000000000015},0.09,{"$f":"AB8*AC8","v":2407.5000000000014},{"$f":"MAX(AA8-AD8,0)","v":27992.5},{"$f":"ROUND((0.01*MIN(500000,AE8)+0.0125*MAX(AE8-500000,0)), 0)","v":280}]
{"$rows_left_out":16}
{"sheet":"Property Tax Impact Val Chg 2","index":3,"n_rows":23,"n_cols":32,"rows_kept":23,"cut":false,"hidden":false,"merged":[[5,16,5,23],[5,24,5,31],[7,1,15,1],[18,1,26,1],[29,1,37,1]]}
[{"$f":"'Specific LLC Information'!A1","v":"Independent School District 720 - Shakopee Public School District"}]
[{"$f":"CONCATENATE(\"Information for TnT Presentation - \",TEXT(M2,\"0.00%\"),\" change in Assessed Valuation\")","v":"Information for TnT Presentation - 5.50% change in Assessed Valuation"},null,null,null,null,null,null,null,null,null,null,null,{"$f":"0.0275*2","v":5.5E-2},"Enter Change in Valuation (Title to left will automatically update)"]
[]
[]
[]
[null,null,null,null,null,null,null,null,null,null,null,null,null,null,null,null,"Pay 2017 MV Exclusion",null,null,null,null,null,null,null,"Pay 2018 MV Exclusion"]
[null,"Type of Property","2016 Estimated Market Value","Actual Pay 2017 School Portion of Taxes","2017 Estimated Market Value","Est. Pay 2018 School Portion of Taxes",null,"Estimated Tax Increase / (Decrease)","Estimated Percent Change",null,null,null,"Pay 2017 NTC of Properties to the left","Pay 2018 NTC of Properties to the left","Chk Figure",null,"Market Value",null,null,null,null,null,null,"MV Exclusion","Market Value",null,null,null,null,null,null,"MV Exclusion"]
[null,"Residential Homestead",100000,{"$f":"(C8*$M$19)+(M8*$M$20)","v":468.61475999999999},{"$f":"C8*(1+$M$2)","v":105500},{"$f":"(E8*$M$22)+(N8*$M$23)","v":540.75448000000006},null,{"$f":"F8-D8","v":72.139720000000068},{"$f":"H8/D8","v":0.15394248358715817},null,null,null,{"$f":"ROUND((0.01*MIN(500000,C8)+0.0125*MAX(C8-500000,0))-X8,0)","v":718},{"$f":"ROUND((0.01*MIN(500000,E8)+0.0125*MAX(E8-500000,0))-AF8,0)","v":778},{"$f":"H8-'Tax Calculator'!N52","v":19.142900000000054},null,{"$f":"C8","v":100000},0.4,{"$f":"MIN(Q8*R8,30400)","v":30400},{"$f":"IF(Q8>76000,Q8-76000,0)","v":24000},0.09,{"$f":"T8*U8","v":2160},{"$f":"MAX(S8-V8,0)","v":28240},{"$f":"ROUND((0.01*MIN(500000,W8)+0.0125*MAX(W8-500000,0)), 0)","v":282},{"$f":"E8","v":105500},0.4,{"$f":"MIN(Y8*Z8,30400)","v":30400},{"$f":"IF(Y8>76000,Y8-76000,0)","v":29500},0.09,{"$f":"AB8*AC8","v":2655},{"$f":"MAX(AA8-AD8,0)","v":27745},{"$f":"ROUND((0.01*MIN(500000,AE8)+0.0125*MAX(AE8-500000,0)), 0)","v":277}]
{"$rows_left_out":16}
{"sheet":"Specific LLC Information","index":4,"n_rows":116,"n_cols":22,"rows_kept":116,"cut":false,"hidden":false,"merged":[[26,0,29,0],[31,0,34,0],[36,0,67,0],[69,0,76,0],[77,11,113,11],[78,0,83,0],[85,0,93,0],[95,0,100,0],[102,0,107,0],[113,0,115,0],[3,0,3,10],[5,11,5,14],[6,11,6,14],[8,0,14,0],[9,11,18,11],[16,0,22,0],[20,11,23,11]]}
[{"$f":"CONCATENATE(\"Independent School District \",District!A7,\" - \",District!B7)","v":"Independent School District 720 - Shakopee Public School District"}]
["Pay 2017 versus Pay 2018 - Comparison"]
["LLC Updated 10-02-17 Worksheet Update 10-30-17"]
[]
[]
[null,null,"(FY18) 2016 Payable 2017 Final Levy",null,null,"(FY19) 2017 Payable 2018 Proposed Levy",null,null,null,null,null,"NEED TO UPDATE THE BELOW INFORMATION!!!!"]
[null,null,"Local Levy","Estimated State Revenue",null,"Local Levy","Estimated State Revenue",null,"Total Levy Change","Total Revenue Change","Notes 1","ADDITIONAL CALCULATIONS"]
[]
{"$rows_left_out":109}
{"sheet":"Scott Co Prelim Data","index":5,"n_rows":235,"n_cols":11,"rows_kept":235,"cut":false,"hidden":false,"merged":[]}
[]
[]
["School District","Unique Taxing Area","NTC or RMV","Classification Type","Value"]
[720,"TAG: 0801/JKSN TWP/ISD 720","Net Tax Capacity","100 Res 1 unit",756178]
[720,"TAG: 0801/JKSN TWP/ISD 720","Net Tax Capacity","140 Res V Land",26750]
[720,"TAG: 0801/JKSN TWP/ISD 720","Net Tax Capacity","200 Agricultural",98925]
[720,"TAG: 0801/JKSN TWP/ISD 720","Net Tax Capacity","300 Commercial",157050]
[720,"TAG: 0801/JKSN TWP/ISD 720","Net Tax Capacity","305 Industrial",45500]
{"$rows_left_out":228}
{"sheet":"720","index":6,"n_rows":92,"n_cols":29,"rows_kept":92,"cut":false,"hidden":false,"merged":[[20,9,20,10],[23,1,25,8],[25,23,25,24],[25,25,25,28],[26,11,26,13],[26,14,26,16],[14,9,14,10],[15,9,15,10],[16,9,16,10],[17,9,17,10],[18,9,18,10],[19,9,19,10],[0,0,0,7],[2,8,2,10],[6,23,6,24],[9,9,9,10],[11,8,11,10],[13,9,13,10],[13,23,13,24]]}
["WHAT IF TAX COMPARISON PAY 2018 vs Pay 2017- ISD 720"]
[]
["   FISCAL YEAR 2017",null,null,null,null,null,null,null,"MARKET VALUE TAX"]
[]
[57005238,"TAX CAPACITY",null,null,27321862,"FINAL CERTIFIED LEVY",null,null,4606879600,"Referendum Market Value"]
[-827765,"TIF (-)",null,null,null,null,null,null,5991217,"CERTIFIED LEVY"]
[-7230486,"FISCAL DISPARITY (-)",null,null,-3200015,"FISCAL DISPARITY (-)",null,null,-703983,"FISCAL DISPARITY (-)"]
[{"$f":"SUM(A5:A7)","v":48946987},"NET TAX CAPACITY",null,null,{"$f":"SUM(E5:E7)","v":24121847},"TAX LEVY OR SPREAD LEVY",null,null,{"$f":"I7+I6","v":5287234},"Tax Levy or Spread Levy "]
{"$rows_left_out":85}
{"sheet":"Tax Calculator","index":7,"n_rows":81,"n_cols":52,"rows_kept":81,"cut":false,"hidden":false,"merged":[[2,0,2,10],[8,0,8,14],[12,19,12,22]]}
[{"$f":"'Specific LLC Information'!A1","v":"Independent School District 720 - Shakopee Public School District"}]
[{"$f":"'Specific LLC Information'!A3","v":"LLC Updated 10-02-17 Worksheet Update 10-30-17"}]
[]
[]
[]
[null,null,null,null,null,null,null,null,null,"RMV Tax Base Appreciation",null,{"$f":"'720'!S15","v":6.2605217640157126E-2}]
[null,null,null,null,null,null,null,null,null,"NTC Tax Base Appreciation",null,{"$f":"'720'!S18","v":4.4045509890118469E-2}]
[null,null,null,null,null,null,null,null,null,"Enter in Property Valuation Appreciation",null,2.75E-2]
{"$rows_left_out":74}
{"sheet":"RMV History","index":8,"n_rows":12,"n_cols":12,"rows_kept":12,"cut":false,"hidden":false,"merged":[]}
["Updated 09-25-17"]
[{"$f":"'Tax Calculator'!A1","v":"Independent School District 720 - Shakopee Public School District"}]
[]
[null,null,"RMV","% Change"]
[null,"2011 for Pay 2012",3938023100]
[null,"2012 for Pay 2013",3634462300,{"$f":"(C6-C5)/C5","v":-7.7084565603487698E-2}]
[null,"2013 for Pay 2014",3771087200,3.7591502875129565E-2]
[null,"2014 for Pay 2015",4197222200,0.11300056917273088]
{"$rows_left_out":5}
{"sheet":"NTC History","index":9,"n_rows":12,"n_cols":12,"rows_kept":12,"cut":false,"hidden":false,"merged":[]}
[{"$f":"'RMV History'!A1","v":"Updated 09-25-17"}]
[{"$f":"'Tax Calculator'!A1","v":"Independent School District 720 - Shakopee Public School District"}]
[]
[null,null,"NTC","% Change"]
[null,"2011 for Pay 2012",40240611]
[null,"2012 for Pay 2013",37001721,{"$f":"(C6-C5)/C5","v":-8.0488091992440169E-2}]
[null,"2013 for Pay 2014",38876125,{"$f":"(C7-C6)/C6","v":5.0657211322684151E-2}]
[null,"2014 for Pay 2015",43710245,0.12434675523859438]
{"$rows_left_out":5}
{"sheet":"District","index":10,"n_rows":60,"n_cols":14,"rows_kept":60,"cut":false,"hidden":false,"merged":[[56,1,56,2],[56,6,56,7],[57,0,57,3],[59,0,59,2],[60,0,62,10],[55,0,55,1],[43,0,43,1],[44,0,44,1],[46,0,46,1],[47,0,47,1],[48,0,48,1],[49,0,49,1],[50,0,50,1],[51,0,51,1],[52,0,52,1],[53,0,53,1],[54,0,54,1],[42,0,42,1],[8,0,8,2],[21,0,21,2],[33,0,34,9],[35,0,35,2],[35,3,35,5],[35,6,35,7],[35,8,35,9],[36,0,36,2],[36,3,36,5],[36,6,36,7],[36,8,36,9],[39,0,39,1],[6,1,6,2],[6,3,6,5],[6,6,6,7],[6,8,6,9],[0,2,0,3],[0,4,2,9],[1,2,1,3],[4,0,4,10],[5,0,5,2],[5,3,5,5],[5,6,5,7],[5,8,5,9],[1,10,2,10],[2,2,2,3],[3,0,3,10]]}
[null,null,"Division of School Finance",null,"S C H O O L   T A X   R E P O R T   -   2 0 1 6   P A Y A B L E   2 0 1 7",null,null,null,null,null,"ED-00119-40"]
[null,null,"1500 Highway 36 West",null,null,null,null,null,null,null,"DUE:  04/01/2016"]
[null,null,"Roseville, MN  55113-4266"]
["GENERAL INSTRUCTIONS AND INFORMATION:  Please read the INSTRUCTIONS FOR COMPLETION on the Instructions tab before completing this report."]
["I D E N T I F I C A T I O N   A N D   G E N E R A L   I N F O R M A T I O N"]
["District Number and Name",null,null,"County Auditor's Office Contact Person",null,null,"Telephone Number",null,"County Name",null,"Date"]
[720,{"$f":"VLOOKUP(A7,Counties!C:F,4,FALSE)","v":"Shakopee Public School District"},null,null,null,null,null,null,{"$f":"VLOOKUP(A7,Counties!C:J,8,FALSE)","v":"Scott Co"}]
[]
{"$rows_left_out":53}
{"sheet":"Ag2School Tax Impact","index":11,"n_rows":43,"n_cols":28,"rows_kept":43,"cut":false,"hidden":false,"merged":[[36,0,38,0],[8,0,18,0],[8,5,18,5],[20,0,22,0],[20,5,22,5],[25,0,25,6],[28,0,28,6]]}
[{"$f":"CONCATENATE(\"ISD \",District!A7,\" - \",District!B7)","v":"ISD 720 - Shakopee Public School District"}]
[]
["Date prepared: June 15, 2017"]
[]
[]
[null,null,null,null,"Total School Portion of Taxes","Est. AG Tax Credit Changes (based on Pay 2017 figures)","Net Impact if Ag2School would have been available Last Year",null,null,"Voter Approved Bonds","Other Debt Service"]
["Type of Property","Estimated Market Value","Referendum Market Value","Net Tax Capacity","Pay 2017","Potential Change","Net Hypothetical ",null,null,"Pay 2017","Pay 2017",null,null,null,null,null,"NTC",null,null,"RMV"]
[]
{"$rows_left_out":36}
{"sheet":"2017 Neighbor Comparison Graph","index":12,"n_rows":51,"n_cols":20,"rows_kept":51,"cut":false,"hidden":false,"merged":[[4,0,4,7]]}
[]
[null,"District #","District Name"]
[null,{"$f":"District!A7","v":720},{"$f":"District!B7","v":"Shakopee Public School District"}]
[]
["PAY 2017 SCHOOL DISTRICT NEIGHBOR COMPARISON GRAPH"]
[]
[null,null,null,null,null,null,null,null,null,null,null,{"$f":"CONCATENATE(\"School Portion of Property Taxes Payable in 2017 on a \",TEXT(M40,\"$0,000\"),\" Homestead Residential Property\")","v":"School Portion of Property Taxes Payable in 2017 on a $200,000 Homestead Residential Property"}]
[]
{"$rows_left_out":44}
{"sheet":"2017 Neighbor Comp Ag Graph","index":13,"n_rows":52,"n_cols":19,"rows_kept":52,"cut":false,"hidden":false,"merged":[[4,0,4,7]]}
[]
[null,"District #","District Name"]
[null,{"$f":"District!A7","v":720},{"$f":"District!B7","v":"Shakopee Public School District"}]
[]
["PAY 2017 SCHOOL DISTRICT NEIGHBOR COMPARISON GRAPH"]
[]
[null,null,null,null,null,null,null,null,null,null,null,{"$f":"CONCATENATE(\"School Portion of Property Taxes Payable in 2017 on a 1-acre Non-homestead Agricultural Property valued at \",TEXT(M40,\"$0,000\"))","v":"School Portion of Property Taxes Payable in 2017 on a 1-acre Non-homestead Agricultural Property valued at $12,000"}]
[]
{"$rows_left_out":45}
{"sheet":"Disclosure","index":14,"n_rows":28,"n_cols":1,"rows_kept":28,"cut":false,"hidden":false,"merged":[]}
[]
[]
[{"$f":"'Specific LLC Information'!A3","v":"LLC Updated 10-02-17 Worksheet Update 10-30-17"}]
[]
[]
["Disclosure Information"]
["Robert W. Baird & Co. Incorporated (“Baird”) is not recommending that you take or not take any action. Baird is not acting as financial advisor or municipal advisor to you and does not owe a fiduciary duty pursuant to Section 15B of the Securities Exchange Act of 1934 to you with respect to the information contained herein and/or accompanying materials (collectively, the “Materials”). Baird is acting for its own interests. You should discuss the Materials with any and all internal or external advisors and experts that you deem appropriate before acting on the Materials."]
[]
{"$rows_left_out":21}
{"sheet":"Page 1","index":15,"n_rows":528,"n_cols":15,"rows_kept":528,"cut":false,"hidden":true,"merged":[]}
[1,2,3,4,5,6,7,8,9,10,11,12,13,14,15]
[null,null,1,2,3,4,5,6,7,8,9,10,11,19,20]
["dst_num","dst_tye","rls_agc_asd_vlu","rls_nag_asd_vlu","prs_asd_vlu","tax_icr_vlu","trs_adj_vlu","ctr_vlu","mil_dtr_vlu","dis_vlu","tot_tax_vlu","mkt_vlu_2","mil_dtr_vlu_job","mkt_vlu_2_job","dst_act_sts"]
[1.2,3,15230,540831224,9074806,-46716798,0,-62272973,440931489,52548027,493479516,43733641575,0,0,1]
[1,1,2997912,13601700,95396,-164557,-230,-340096,16190125,337465,16527590,761843223,0,0,1]
[2,1,478759,875658,38210,0,-393,0,1392234,0,1392234,73800245,0,0,1]
[4,1,1777501,6666099,38151,-12541,-530,0,8468680,0,8468680,291062031,0,0,1]
[6,3,0,14665644,547530,-1732491,0,-1166149,12314534,3902814,16217348,1394111550,0,0,1]
{"$rows_left_out":521}
{"sheet":"Page 2 Top","index":16,"n_rows":535,"n_cols":21,"rows_kept":535,"cut":false,"hidden":true,"merged":[]}
[1,2,3,4,5,6,7,8,9,10,11,12,13,14,15,16,17,18,19,20,21]
[null,null,null,"21-1","22-1","23-1","24-1","25-1","26-1","21-2","22-2","23-2","24-2","25-2","26-2","21-RMV sub","22-RMV sub","23-RMV sub","24-RMV sub","25-RMV sub","26-RMV sub"]
["dst_num","dst_tye","dst_act_sts","mnt_crt_tax_lvy_6","mnt_cua_tax_adj_6","mnt_fid_tax_adj_6","mnt_adj_tax_lvy_6","mnt_tax_rat_6","mnt_spd_tax_lvy_6","mnt_crt_tax_lvy_5","mnt_cua_tax_adj_5","mnt_fid_tax_adj_5","mnt_adj_tax_lvy_5","mnt_tax_rat_5","mnt_spd_tax_lvy_5","tot_aud_crt_lvy_2","tot_aud_cou_adj_2","tot_aud_fiy_dip_2","tot_aud_adj_lvy_2","tot_aud_tax_rat_2","tot_aud_spr_lvy_2"]
[1,1,1,0,0,0,0,0,0,495469.91,0,0,495469.91,6.5040000000000001E-2,495502.83,495469.91,0,0,495469.91,6.5040000000000001E-2,495502.83]
[1.2,3,1,64807021.289999999,0,-7219215.71,57587805.579999998,0.13167999999999999,57588459.229999997,23999899.390000001,0,-2673487.44,21326411.949999999,4.8770000000000001E-2,21328897,88806920.680000007,0,-9892703.1500000004,78914217.530000001,0.18045,78917356.230000004]
[2,1,1,0,0,0,0,0,0,103169.96,0,0,103169.96,0.13980000000000001,103172.74,103169.96,0,0,103169.96,0.13980000000000001,103172.74]
[4,1,1,411.43,0,0,411.43,1.3999999999999999E-4,407.49,121092.15,0,0,121092.15,4.1599999999999998E-2,121081.8,121503.58,0,0,121503.58,4.1739999999999999E-2,121489.29]
[6,3,1,1319306,0,-379199,940107,6.7430000000000004E-2,940049.42,1563168,0,-449290,1113878,7.9909999999999995E-2,1114034.54,2882474,0,-828489,2053985,0.14734,2054083.96]
{"$rows_left_out":528}
{"sheet":"Page 2 Middle","index":17,"n_rows":528,"n_cols":27,"rows_kept":528,"cut":false,"hidden":true,"merged":[]}
[1,2,3,4,5,6,7,8,9,10,11,12,13,14,15,16,17,18,19,20,21,22,23,24,25,26,27]
[null,null,null,"21-3","22-3","23-3","24-3","25-3","26-3","21-4","22-4","23-4","24-4","25-4","26-4","21-5","22-5","23-5","24-5","25-5","26-5","21-6","22-6","23-6","24-6","25-6","26-6"]
["dst_num","dst_tye","dst_act_sts","mnt_crt_tax_lvy_3","mnt_cua_tax_adj_3","mnt_fid_tax_adj_3","mnt_adj_tax_lvy_3","mnt_tax_rat_3","mnt_spd_tax_lvy_3","mnt_crt_tax_lvy_7","mnt_cua_tax_adj_7","mnt_fid_tax_adj_7","mnt_adj_tax_lvy_7","mnt_tax_rat_7","mnt_spd_tax_lvy_7","mnt_crt_tax_lvy","mnt_cua_tax_adj","mnt_fid_tax_adj","mnt_adj_tax_lvy","mnt_tax_mil_rat","mnt_spd_tax_lvy","cse_crt_tax_lvy","cse_cua_tax_adj","cse_fid_tax_adj","cse_adj_tax_lvy","cse_tax_mil_rat","cse_spd_tax_lvy"]
[1,1,1,0,0,0,0,0,0,23582.74,0,-916.06,22666.68,0.14000000000000001,22666.18,530245.86,0,-20597.84,509648.02,3.1480000000000001,509665.14,0,0,0,0,0,0]
[1.2,3,1,0,0,0,0,0,0,717563.47,0,-79920.5,637642.97,0.14499999999999999,639350.66,30260140.280000001,0,-3370845.89,26889294.390000001,6.0990000000000002,26892411.510000002,5330747.45,0,-593831.85,4736915.5999999996,1.075,4740013.51]
[2,1,1,0,0,0,0,0,0,1870.28,0,0,1870.28,0.13400000000000001,1865.59,67990.759999999995,0,0,67990.759999999995,4.8840000000000003,67996.710000000006,16950.599999999999,0,0,16950.599999999999,1.218,16957.41]
[4,1,1,0,0,0,0,0,0,12239.94,0,0,12239.94,0.14499999999999999,12279.59,282939.59999999998,0,0,282939.59999999998,3.3410000000000002,282938.59999999998,56360.3,0,0,56360.3,0.66600000000000004,56401.41]
[6,3,1,566074,0,-138673,427401,3.4710000000000001,427437.48,23795,0,-5830,17965,0.14599999999999999,17979.22,1500064,0,-367475,1132589,9.1980000000000004,1132690.8400000001,511682,0,-125348,386334,3.137,386306.93]
{"$rows_left_out":521}
{"sheet":"Page 2 Bottom","index":18,"n_rows":535,"n_cols":23,"rows_kept":535,"cut":false,"hidden":true,"merged":[]}
[1,2,3,4,5,6,7,8,9,10,11,12,13,14,15,16,17,18,19,20,21,22,23]
[null,null,null,"21-7","22-7","23-7","24-7","25-7","26-7","21-8","22-8","23-8","24-8","25-8","26-8","21-NTC sub","22-NTC sub","23-NTC sub","24-NTC sub","25-NTC sub","26-NTC sub"]
["dst_num","dst_tye","dst_act_sts","gds_crt_tax_lvy","gds_cua_tax_adj","gds_fid_tax_adj","gds_adj_tax_lvy","gds_tax_mil_rat","gds_spd_tax_lvy","gds_crt_tax_lvy_2","gds_cua_tax_adj_2","gds_fid_tax_adj_2","gds_adj_tax_lvy_2","gds_tax_rat_2","gds_spd_tax_lvy_2","tot_aud_crt_lvy","tot_aud_cou_adj","tot_aud_fiy_dip","tot_aud_adj_lvy","tot_aud_tax_rat","tot_aud_spr_lvy","dip_aid_aud","tot_spr_lvy"]
[1,1,1,0,0,0,0,0,0,124968.79,0,-4854.5200000000004,120114.27,0.74199999999999999,120130.73,678797.39,0,-26368.42,652428.97,4.03,652462.05000000005,28,1147936.8799999999]
[1.2,3,1,0,0,0,0,0,0,63425842.920000002,0,-7065350.6699999999,56360492.25,12.782999999999999,56364272.240000002,102105299.12,0,-11374060.85,90731238.269999996,20.58,90743700.439999998,430047,169231009.66999999]
[2,1,1,205425.8,0,0,205425.8,14.755000000000001,205424.13,0,0,0,0,0,0,292237.44,0,0,292237.44,20.991,292243.84000000003,6156,389260.58]
[4,1,1,691037.39,0,0,691037.39,8.16,691044.29,120133.73,0,0,120133.73,1.419,120170.57,1315618.93,0,0,1315618.93,15.537000000000001,1315778.82,5722,1431546.11]
[6,3,1,2348997,0,-575440,1773557,14.401999999999999,1773539.19,178125,0,-43636,134489,1.0920000000000001,134474.71,5849927,0,-1433074,4416853,35.868000000000002,4416977.0599999996,0,6471061.0199999996]
{"$rows_left_out":528}
{"sheet":"Page 2 OPEB","index":19,"n_rows":528,"n_cols":15,"rows_kept":528,"cut":false,"hidden":true,"merged":[]}
[1,2,3,4,5,6,7,8,9,10,11,12,13,14,15]
[null,null,null,"21-9","22-9","23-9","24-9","25-9","26-9","21-10","22-10","23-10","24-10","25-10","26-10"]
["dst_num","dst_tye","dst_act_sts","peb_crt_tax_lvy","peb_cua_tax_adj","peb_fid_tax_adj","peb_adj_tax_lvy","peb_tax_mil_rat","peb_spd_tax_lvy","peb_crt_tax_lvy_2","peb_cua_tax_adj_2","peb_fid_tax_adj_2","peb_adj_tax_lvy_2","peb_tax_mil_rat_2","peb_spd_tax_lvy_2"]
[1,1,1,0,0,0,0,0,0,0,0,0,0,0,0]
[1.2,3,1,0,0,0,0,0,0,2371005,0,-264111.94,2106893.06,0.47799999999999998,2107652.52]
[2,1,1,0,0,0,0,0,0,0,0,0,0,0,0]
[4,1,1,0,0,0,0,0,0,152907.97,0,0,152907.97,1.806,152944.35999999999]
[6,3,1,0,0,0,0,0,0,721190,0,-176672,544518,4.4219999999999997,544548.68999999994]
{"$rows_left_out":521}
{"sheet":"Counties","index":20,"n_rows":333,"n_cols":10,"rows_kept":333,"cut":false,"hidden":true,"merged":[]}
["atv_sts","dat_yer","uni_maj","uni_tye","uni_nam","Proper","uni_imd","cou_num","ecu_rgn","cou_name"]
["A","15-16",1,1,"AITKIN PUBLIC SCHOOL DISTRICT",{"$f":"PROPER(E2)","v":"Aitkin Public School District"},0,1,3,"Aitkin Co"]
["A","15-16",2,1,"HILL CITY PUBLIC SCHOOL DISTRICT",{"$f":"PROPER(E3)","v":"Hill City Public School District"},0,1,3,"Aitkin Co"]
["A","15-16",4,1,"MCGREGOR PUBLIC SCHOOL DISTRICT","Mcgregor Public School District",0,1,3,"Aitkin Co"]
["A","15-16",11,1,"ANOKA-HENNEPIN PUBLIC SCHOOL DIST.","Anoka-Hennepin Public School Dist.",0,2,11,"Anoka Co"]
["A","15-16",12,1,"CENTENNIAL PUBLIC SCHOOL DISTRICT","Centennial Public School District",0,2,11,"Anoka Co"]
["A","15-16",13,1,"COLUMBIA HEIGHTS PUBLIC SCHOOL DIST","Columbia Heights Public School Dist",0,2,11,"Anoka Co"]
["A","15-16",14,1,"FRIDLEY PUBLIC SCHOOL DISTRICT","Fridley Public School District",0,2,11,"Anoka Co"]
{"$rows_left_out":325}