{"text_format":"1","workbook":"xlsx","n_sheets":21,"sheets":["Table of Contents","Property Tax Impact Static","Property Tax Impact Value Chg","Property Tax Impact Val Chg 2","Specific LLC Information","Scott Co Prelim Data","720","Tax Calculator","RMV History","NTC History","District","Ag2School Tax Impact","2017 Neighbor Comparison Graph","2017 Neighbor Comp Ag Graph","Disclosure","Page 1","Page 2 Top","Page 2 Middle","Page 2 Bottom","Page 2 OPEB","Counties"],"not_rendered":{"charts":4,"images":3,"macros":1,"external_links":0,"defined_names":71,"comments":1,"pivot_tables":0},"unopened":[],"bounds":{"document_bytes":16777216,"sheet_cells":100000,"rows_first":2000,"rows_last":500,"rows_between":2000,"halvings":0,"cell_chars":16384,"cell_head_chars":4096},"cells_cut":0,"cells_raw":0,"read":"whole","date_system":"1900"}

{"sheet":"Table of Contents","index":0,"n_rows":25,"n_cols":14,"rows_kept":25,"cut":false,"hidden":false,"merged":[]}
[{"$f":"CONCATENATE(\"Independent School District \",District!A7,\" - \",District!B7)","v":"Independent School District 720 - Shakopee Public School District"}]
[{"$f":"'Specific LLC Information'!A3","v":"LLC Updated 10-02-17 Worksheet Update 10-30-17"}]
[]
[]
[]
[null,"Tab Name","Notes"]
[]
[null,"Table of Contents"]
[null,"Property Tax Impact Static","Allows user to pick 9 homestead residential values and compare impacts from year to year for same value"]
[null,"Property Tax Impact Value Chg","Allows user to pick 9 homestead residential values and compare impacts from year to year using a growth factor from Tax Calculator tab"]
[null,"Property Tax Impact Val Chg 2","Allows user to pick 9 homestead residential values and compare impacts from year to year using a 5.5% growth factor"]
[null,"Specific LLC Information","Using levy limitation and certification report enter in last two years of data to see year by year comparison"]
[null,"Scott Co Prelim Data","Unique Taxing Area Pay 2018 RMV and NTC tax base information"]
[null,"720","Updated tax base data from Scott County for ISD 720"]
[null,"Tax Calculator","Use this to input growth assumptions and compare tax impact information"]
[null,"RMV History","Use this tab to keep track of referendum market value history"]
[null,"NTC History","Use this tab to keep track of net tax capacity value history"]
[null,"District","Specifically shows District's Pay 2017 School Tax Report"]
[null,"Ag2School Tax Impact","Shows impact of Ag2School Tax Credit if it would have been available in Pay 2017",null,null,null,null,null,null,null,null,null,null,"VBA code for inserting all worksheet names in cells"]
[null,"2017 Neighbor Comparison Graph","Input ISD #'s and allows user to input homestead residential value to see comparison of school portion of taxes"]
[null,"2017 Neighbor Comp Ag Graph","Utilizes previous tabs ISD #'s and allows user to input value of 1-acre of land to see comparison of school portion of taxes",null,null,null,null,null,null,null,null,null,null,"Sub SheetNames()"]
[null,"Disclosure","Baird Disclosure language",null,null,null,null,null,null,null,null,null,null,"For i = 1 To Sheets.Count"]
[null,null,null,null,null,null,null,null,null,null,null,null,null,"Cells(i + 7, 2) = Sheets(i).Name"]
[null,null,null,null,null,null,null,null,null,null,null,null,null,"Next i"]
[null,null,null,null,null,null,null,null,null,null,null,null,null,"End Sub"]

{"sheet":"Property Tax Impact Static","index":1,"n_rows":23,"n_cols":32,"rows_kept":23,"cut":false,"hidden":false,"merged":[[5,16,5,23],[5,24,5,31],[7,1,15,1],[18,1,26,1],[29,1,37,1]]}
[{"$f":"'Specific LLC Information'!A1","v":"Independent School District 720 - Shakopee Public School District"}]
["Information for TnT Presentation - No Change in Valuation"]
[]
[]
[]
[null,null,null,null,null,null,null,null,null,null,null,null,null,null,null,null,"Pay 2017 MV Exclusion",null,null,null,null,null,null,null,"Pay 2018 MV Exclusion"]
[null,"Type of Property","2016 Estimated Market Value","Actual Pay 2017 School Portion of Taxes","2017 Estimated Market Value","Est. Pay 2018 School Portion of Taxes",null,"Estimated Tax Increase / (Decrease)","Estimated Percent Change",null,null,null,"Pay 2017 NTC of Properties to the left","Pay 2018 NTC of Properties to the left","Chk Figure",null,"Market Value",null,null,null,null,null,null,"MV Exclusion","Market Value",null,null,null,null,null,null,"MV Exclusion"]
[null,"Residential Homestead",100000,{"$f":"(C8*$M$19)+(M8*$M$20)","v":468.61475999999999},{"$f":"C8","v":100000},{"$f":"(E8*$M$22)+(N8*$M$23)","v":502.46868000000006},null,{"$f":"F8-D8","v":33.853920000000073},{"$f":"H8/D8","v":7.224253883936578E-2},null,null,null,{"$f":"ROUND((0.01*MIN(500000,C8)+0.0125*MAX(C8-500000,0))-X8,0)","v":718},{"$f":"ROUND((0.01*MIN(500000,E8)+0.0125*MAX(E8-500000,0))-AF8,0)","v":718},{"$f":"H8-'Tax Calculator'!N52","v":-19.142899999999941},null,{"$f":"C8","v":100000},0.4,{"$f":"MIN(Q8*R8,30400)","v":30400},{"$f":"IF(Q8>76000,Q8-76000,0)","v":24000},0.09,{"$f":"T8*U8","v":2160},{"$f":"MAX(S8-V8,0)","v":28240},{"$f":"ROUND((0.01*MIN(500000,W8)+0.0125*MAX(W8-500000,0)), 0)","v":282},{"$f":"E8","v":100000},0.4,{"$f":"MIN(Y8*Z8,30400)","v":30400},{"$f":"IF(Y8>76000,Y8-76000,0)","v":24000},0.09,{"$f":"AB8*AC8","v":2160},{"$f":"MAX(AA8-AD8,0)","v":28240},{"$f":"ROUND((0.01*MIN(500000,AE8)+0.0125*MAX(AE8-500000,0)), 0)","v":282}]
[null,null,{"$f":"C8+50000","v":150000},794.58665999999994,{"$f":"C9","v":150000},850.28538000000015,null,55.698720000000208,7.0097728547318189E-2,null,null,null,1263,1263,{"$f":"H9-'Tax Calculator'!N54","v":-28.19509000000005},null,150000,0.4,30400,74000,0.09,6660,23740,237,150000,0.4,30400,74000,0.09,6660,23740,237]
[null,null,{"$f":"C9+50000","v":200000},1120.5585599999999,200000,1198.1020800000001,null,77.543520000000171,6.9200774299560189E-2,null,null,null,1808,1808,{"$f":"H10-'Tax Calculator'!N56","v":-38.285800000000108},null,200000,0.4,30400,124000,0.09,11160,19240,192,200000,0.4,30400,124000,0.09,11160,19240,192]
[null,null,{"$f":"C10+25000","v":225000},1283.2981,225000,1371.7508000000003,null,88.452700000000277,6.8926074152217853E-2,null,null,null,2080,2080,{"$f":"H11-'Tax Calculator'!N57","v":-43.331154999999853},null,225000,0.4,30400,149000,0.09,13410,16990,170,225000,0.4,30400,149000,0.09,13410,16990,170]
[null,null,{"$f":"C11+25000","v":250000},1446.5304599999999,250000,1545.91878,null,99.388320000000022,6.8708072694162292E-2,null,null,null,2353,2353,{"$f":"H12-'Tax Calculator'!N58","v":-47.857250000000249},null,250000,0.4,30400,174000,0.09,15660,14740,147,250000,0.4,30400,174000,0.09,15660,14740,147]
[null,null,{"$f":"C12+50000","v":300000},1772.50236,300000,1893.7354800000003,null,121.23312000000033,6.8396591584792207E-2,null,null,null,2898,2898,{"$f":"H13-'Tax Calculator'!N60","v":-57.428699999999935},null,300000,0.4,30400,224000,0.09,20160,10240,102,300000,0.4,30400,224000,0.09,20160,10240,102]
[null,null,350000,2098.47426,350000,2241.5521800000001,null,143.07792000000018,6.8181879914981744E-2,null,null,null,3443,3443,{"$f":"H14-'Tax Calculator'!N62","v":-66.480890000000272},null,350000,0.4,30400,274000,0.09,24660,5740,57,350000,0.4,30400,274000,0.09,24660,5740,57]
[null,null,400000,2424.44616,400000,2589.36888,null,164.92272000000003,6.8024905118948917E-2,null,null,null,3988,3988,null,null,400000,0.4,30400,324000,0.09,29160,1240,12,400000,0.4,30400,324000,0.09,29160,1240,12]
[null,null,{"$f":"C15+100000","v":500000},3037.95,500000,3244.5,null,206.55000000000018,6.7989927418160331E-2,null,null,null,5000,5000,{"$f":"H16-'Tax Calculator'!N63","v":-107.13822000000027},null,500000,0.4,30400,424000,0.09,38160,0,0,500000,0.4,30400,424000,0.09,38160,0,0]
[]
[]
[null,null,null,null,null,null,null,null,null,null,null,null,{"$f":"'Tax Calculator'!F21","v":1.1477E-3},"Pay 17 RMV Rate"]
[null,null,null,null,null,null,null,null,null,null,null,null,{"$f":"'Tax Calculator'!H49","v":0.49281999999999998},"Pay 17 NTC Rate"]
[]
[null,null,null,null,null,null,null,null,null,null,null,null,{"$f":"'Tax Calculator'!J21","v":1.2964000000000001E-3},"Pay 18 RMV Rate"]
[null,null,null,null,null,null,null,null,null,null,null,null,{"$f":"'Tax Calculator'!L49","v":0.51926000000000005},"Pay 18 NTC Rate"]

{"sheet":"Property Tax Impact Value Chg","index":2,"n_rows":23,"n_cols":32,"rows_kept":23,"cut":false,"hidden":false,"merged":[[5,16,5,23],[5,24,5,31],[7,1,15,1],[18,1,26,1],[29,1,37,1]]}
[{"$f":"'Specific LLC Information'!A1","v":"Independent School District 720 - Shakopee Public School District"}]
[{"$f":"CONCATENATE(\"Information for TnT Presentation - \",TEXT(M2,\"0.00%\"),\" change in Assessed Valuation\")","v":"Information for TnT Presentation - 2.75% change in Assessed Valuation"},null,null,null,null,null,null,null,null,null,null,null,{"$f":"'Tax Calculator'!L8","v":2.75E-2},"Enter Change in Valuation (Title to left will automatically update)"]
[]
[]
[]
[null,null,null,null,null,null,null,null,null,null,null,null,null,null,null,null,"Pay 2017 MV Exclusion",null,null,null,null,null,null,null,"Pay 2018 MV Exclusion"]
[null,"Type of Property","2016 Estimated Market Value","Actual Pay 2017 School Portion of Taxes","2017 Estimated Market Value","Est. Pay 2018 School Portion of Taxes",null,"Estimated Tax Increase / (Decrease)","Estimated Percent Change",null,null,null,"Pay 2017 NTC of Properties to the left","Pay 2018 NTC of Properties to the left","Chk Figure",null,"Market Value",null,null,null,null,null,null,"MV Exclusion","Market Value",null,null,null,null,null,null,"MV Exclusion"]
[null,"Residential Homestead",100000,{"$f":"(C8*$M$19)+(M8*$M$20)","v":468.61475999999999},{"$f":"C8*(1+$M$2)","v":102750.00000000001},{"$f":"(E8*$M$22)+(N8*$M$23)","v":521.61158},null,{"$f":"F8-D8","v":52.996820000000014},{"$f":"H8/D8","v":0.11309251121326186},null,null,null,{"$f":"ROUND((0.01*MIN(500000,C8)+0.0125*MAX(C8-500000,0))-X8,0)","v":718},{"$f":"ROUND((0.01*MIN(500000,E8)+0.0125*MAX(E8-500000,0))-AF8,0)","v":748},{"$f":"H8-'Tax Calculator'!N52","v":0},null,{"$f":"C8","v":100000},0.4,{"$f":"MIN(Q8*R8,30400)","v":30400},{"$f":"IF(Q8>76000,Q8-76000,0)","v":24000},0.09,{"$f":"T8*U8","v":2160},{"$f":"MAX(S8-V8,0)","v":28240},{"$f":"ROUND((0.01*MIN(500000,W8)+0.0125*MAX(W8-500000,0)), 0)","v":282},{"$f":"E8","v":102750.00000000001},0.4,{"$f":"MIN(Y8*Z8,30400)","v":30400},{"$f":"IF(Y8>76000,Y8-76000,0)","v":26750.000000000015},0.09,{"$f":"AB8*AC8","v":2407.5000000000014},{"$f":"MAX(AA8-AD8,0)","v":27992.5},{"$f":"ROUND((0.01*MIN(500000,AE8)+0.0125*MAX(AE8-500000,0)), 0)","v":280}]
[null,null,{"$f":"C8+50000","v":150000},794.58665999999994,{"$f":"C9*(1+$M$2)","v":154125},878.4804700000002,null,83.893810000000258,0.10558169954678104,null,null,null,1263,1307,{"$f":"H9-'Tax Calculator'!N54","v":0},null,150000,0.4,30400,74000,0.09,6660,23740,237,154125,0.4,30400,78125,0.09,7031.25,23368.75,234]
[null,null,{"$f":"C9+50000","v":200000},1120.5585599999999,205500.00000000003,1236.3878800000002,null,115.82932000000028,0.1033674848729015,null,null,null,1808,1868,{"$f":"H10-'Tax Calculator'!N56","v":0},null,200000,0.4,30400,124000,0.09,11160,19240,192,205500.00000000003,0.4,30400,129500.00000000003,0.09,11655.000000000002,18745,187]
[null,null,{"$f":"C10+25000","v":225000},1283.2981,231187.50000000003,1415.0819550000001,null,131.78385500000013,0.10269153753130324,null,null,null,2080,2148,{"$f":"H11-'Tax Calculator'!N57","v":0},null,225000,0.4,30400,149000,0.09,13410,16990,170,231187.50000000003,0.4,30400,155187.50000000003,0.09,13966.875000000002,16433.125,164]
[null,null,{"$f":"C11+25000","v":250000},1446.5304599999999,256875.00000000003,1593.7760300000002,null,147.24557000000027,0.10179223602384445,null,null,null,2353,2428,{"$f":"H12-'Tax Calculator'!N58","v":0},null,250000,0.4,30400,174000,0.09,15660,14740,147,256875.00000000003,0.4,30400,180875.00000000003,0.09,16278.750000000002,14121.249999999998,141]
[null,null,{"$f":"C12+50000","v":300000},1772.50236,308250,1951.1641800000002,null,178.66182000000026,0.10079637919353758,null,null,null,2898,2988,{"$f":"H13-'Tax Calculator'!N60","v":0},null,300000,0.4,30400,224000,0.09,20160,10240,102,308250,0.4,30400,232250,0.09,20902.5,9497.5,95]
[null,null,350000,2098.47426,359625,2308.0330700000004,null,209.55881000000045,9.9862463883641089E-2,null,null,null,3443,3547,{"$f":"H14-'Tax Calculator'!N62","v":0},null,350000,0.4,30400,274000,0.09,24660,5740,57,359625,0.4,30400,283625,0.09,25526.25,4873.75,49]
[null,null,400000,2424.44616,411000.00000000006,2665.9404800000002,null,241.49432000000024,9.9608035841059983E-2,null,null,null,3988,4108,null,null,400000,0.4,30400,324000,0.09,29160,1240,12,411000.00000000006,0.4,30400,335000.00000000006,0.09,30150.000000000004,249.99999999999636,2]
[null,null,{"$f":"C15+100000","v":500000},3037.95,513750.00000000006,3351.6382200000003,null,313.68822000000046,0.10325654470942593,null,null,null,5000,5172,{"$f":"H16-'Tax Calculator'!N63","v":0},null,500000,0.4,30400,424000,0.09,38160,0,0,513750.00000000006,0.4,30400,437750.00000000006,0.09,39397.500000000007,0,0]
[]
[]
[null,null,null,null,null,null,null,null,null,null,null,null,{"$f":"'Property Tax Impact Static'!M19","v":1.1477E-3},"Pay 17 RMV Rate"]
[null,null,null,null,null,null,null,null,null,null,null,null,{"$f":"'Property Tax Impact Static'!M20","v":0.49281999999999998},"Pay 17 NTC Rate"]
[]
[null,null,null,null,null,null,null,null,null,null,null,null,{"$f":"'Property Tax Impact Static'!M22","v":1.2964000000000001E-3},"Pay 18 RMV Rate"]
[null,null,null,null,null,null,null,null,null,null,null,null,{"$f":"'Property Tax Impact Static'!M23","v":0.51926000000000005},"Pay 18 NTC Rate"]

{"sheet":"Property Tax Impact Val Chg 2","index":3,"n_rows":23,"n_cols":32,"rows_kept":23,"cut":false,"hidden":false,"merged":[[5,16,5,23],[5,24,5,31],[7,1,15,1],[18,1,26,1],[29,1,37,1]]}
[{"$f":"'Specific LLC Information'!A1","v":"Independent School District 720 - Shakopee Public School District"}]
[{"$f":"CONCATENATE(\"Information for TnT Presentation - \",TEXT(M2,\"0.00%\"),\" change in Assessed Valuation\")","v":"Information for TnT Presentation - 5.50% change in Assessed Valuation"},null,null,null,null,null,null,null,null,null,null,null,{"$f":"0.0275*2","v":5.5E-2},"Enter Change in Valuation (Title to left will automatically update)"]
[]
[]
[]
[null,null,null,null,null,null,null,null,null,null,null,null,null,null,null,null,"Pay 2017 MV Exclusion",null,null,null,null,null,null,null,"Pay 2018 MV Exclusion"]
[null,"Type of Property","2016 Estimated Market Value","Actual Pay 2017 School Portion of Taxes","2017 Estimated Market Value","Est. Pay 2018 School Portion of Taxes",null,"Estimated Tax Increase / (Decrease)","Estimated Percent Change",null,null,null,"Pay 2017 NTC of Properties to the left","Pay 2018 NTC of Properties to the left","Chk Figure",null,"Market Value",null,null,null,null,null,null,"MV Exclusion","Market Value",null,null,null,null,null,null,"MV Exclusion"]
[null,"Residential Homestead",100000,{"$f":"(C8*$M$19)+(M8*$M$20)","v":468.61475999999999},{"$f":"C8*(1+$M$2)","v":105500},{"$f":"(E8*$M$22)+(N8*$M$23)","v":540.75448000000006},null,{"$f":"F8-D8","v":72.139720000000068},{"$f":"H8/D8","v":0.15394248358715817},null,null,null,{"$f":"ROUND((0.01*MIN(500000,C8)+0.0125*MAX(C8-500000,0))-X8,0)","v":718},{"$f":"ROUND((0.01*MIN(500000,E8)+0.0125*MAX(E8-500000,0))-AF8,0)","v":778},{"$f":"H8-'Tax Calculator'!N52","v":19.142900000000054},null,{"$f":"C8","v":100000},0.4,{"$f":"MIN(Q8*R8,30400)","v":30400},{"$f":"IF(Q8>76000,Q8-76000,0)","v":24000},0.09,{"$f":"T8*U8","v":2160},{"$f":"MAX(S8-V8,0)","v":28240},{"$f":"ROUND((0.01*MIN(500000,W8)+0.0125*MAX(W8-500000,0)), 0)","v":282},{"$f":"E8","v":105500},0.4,{"$f":"MIN(Y8*Z8,30400)","v":30400},{"$f":"IF(Y8>76000,Y8-76000,0)","v":29500},0.09,{"$f":"AB8*AC8","v":2655},{"$f":"MAX(AA8-AD8,0)","v":27745},{"$f":"ROUND((0.01*MIN(500000,AE8)+0.0125*MAX(AE8-500000,0)), 0)","v":277}]
[null,null,{"$f":"C8+50000","v":150000},794.58665999999994,{"$f":"C9*(1+$M$2)","v":158250},907.71408000000008,null,113.12742000000014,0.14237266454989334,null,null,null,1263,1353,{"$f":"H9-'Tax Calculator'!N54","v":29.233609999999885},null,150000,0.4,30400,74000,0.09,6660,23740,237,158250,0.4,30400,82250,0.09,7402.5,22997.5,230]
[null,null,{"$f":"C9+50000","v":200000},1120.5585599999999,211000,1274.1544200000001,null,153.59586000000013,0.13707080154739984,null,null,null,1808,1927,{"$f":"H10-'Tax Calculator'!N56","v":37.76653999999985},null,200000,0.4,30400,124000,0.09,11160,19240,192,211000,0.4,30400,135000,0.09,12150,18250,183]
[null,null,{"$f":"C10+25000","v":225000},1283.2981,237375,1457.8938500000002,null,174.59575000000018,0.13605237161965733,null,null,null,2080,2215,{"$f":"H11-'Tax Calculator'!N57","v":42.81189500000005},null,225000,0.4,30400,149000,0.09,13410,16990,170,237375,0.4,30400,161375,0.09,14523.75,15876.25,159]
[null,null,{"$f":"C11+25000","v":250000},1446.5304599999999,263750,1641.6332800000002,null,195.10282000000029,0.13487639935352644,null,null,null,2353,2503,{"$f":"H12-'Tax Calculator'!N58","v":47.857250000000022},null,250000,0.4,30400,174000,0.09,15660,14740,147,263750,0.4,30400,187750,0.09,16897.5,13502.5,135]
[null,null,{"$f":"C12+50000","v":300000},1772.50236,316500,2008.0736200000001,null,235.57126000000017,0.13290321373676489,null,null,null,2898,3077,{"$f":"H13-'Tax Calculator'!N60","v":56.909439999999904},null,300000,0.4,30400,224000,0.09,20160,10240,102,316500,0.4,30400,240500,0.09,21645,8755,88]
[null,null,350000,2098.47426,369250,2375.5524800000003,null,277.07822000000033,0.13203794074653091,null,null,null,3443,3653,{"$f":"H14-'Tax Calculator'!N62","v":67.51940999999988},null,350000,0.4,30400,274000,0.09,24660,5740,57,369250,0.4,30400,293250,0.09,26392.5,4007.5,40]
[null,null,400000,2424.44616,422000,2738.3580000000006,null,313.91184000000067,0.12947775256019736,null,null,null,3988,4220,null,null,400000,0.4,30400,324000,0.09,29160,1240,12,422000,0.4,30400,346000,0.09,31140,0,0]
[null,null,{"$f":"C15+100000","v":500000},3037.95,527500,3458.7764400000005,null,420.82644000000073,0.13852316200069151,null,null,null,5000,5344,{"$f":"H16-'Tax Calculator'!N63","v":107.13822000000027},null,500000,0.4,30400,424000,0.09,38160,0,0,527500,0.4,30400,451500,0.09,40635,0,0]
[]
[]
[null,null,null,null,null,null,null,null,null,null,null,null,{"$f":"'Property Tax Impact Static'!M19","v":1.1477E-3},"Pay 17 RMV Rate"]
[null,null,null,null,null,null,null,null,null,null,null,null,{"$f":"'Property Tax Impact Static'!M20","v":0.49281999999999998},"Pay 17 NTC Rate"]
[]
[null,null,null,null,null,null,null,null,null,null,null,null,{"$f":"'Property Tax Impact Static'!M22","v":1.2964000000000001E-3},"Pay 18 RMV Rate"]
[null,null,null,null,null,null,null,null,null,null,null,null,{"$f":"'Property Tax Impact Static'!M23","v":0.51926000000000005},"Pay 18 NTC Rate"]

{"sheet":"Specific LLC Information","index":4,"n_rows":116,"n_cols":22,"rows_kept":116,"cut":false,"hidden":false,"merged":[[26,0,29,0],[31,0,34,0],[36,0,67,0],[69,0,76,0],[77,11,113,11],[78,0,83,0],[85,0,93,0],[95,0,100,0],[102,0,107,0],[113,0,115,0],[3,0,3,10],[5,11,5,14],[6,11,6,14],[8,0,14,0],[9,11,18,11],[16,0,22,0],[20,11,23,11]]}
[{"$f":"CONCATENATE(\"Independent School District \",District!A7,\" - \",District!B7)","v":"Independent School District 720 - Shakopee Public School District"}]
["Pay 2017 versus Pay 2018 - Comparison"]
["LLC Updated 10-02-17 Worksheet Update 10-30-17"]
[]
[]
[null,null,"(FY18) 2016 Payable 2017 Final Levy",null,null,"(FY19) 2017 Payable 2018 Proposed Levy",null,null,null,null,null,"NEED TO UPDATE THE BELOW INFORMATION!!!!"]
[null,null,"Local Levy","Estimated State Revenue",null,"Local Levy","Estimated State Revenue",null,"Total Levy Change","Total Revenue Change","Notes 1","ADDITIONAL CALCULATIONS"]
[]
["General RMV - Voter-Approved-JOBZ Exempt","1st Tier RMV Ref",null,null,null,null,null,null,{"$f":"F9-C9","v":0},{"$f":"G9-D9","v":0},null,null,null,"Est. Taxes Payable 16","Est. Taxes Payable 17",null,null,null,null,null,590220,"Pay 17 First Tier Op Levy Rev"]
[null,"2nd Tier RMV Ref",null,null,null,null,null,null,{"$f":"F10-C10","v":0},0,null,"OPERATING REFERENDUM","Est. Adj. PU",9026.4,9162,null,null,null,null,null,0.72519814999999999,"Pay 16 Levy Ratio"]
[null,"3rd Tier RMV Ref",null,null,null,null,null,null,0,0,null,null,"Est. Res. PU",9740.4,10044,null,null,null,null,null,{"$f":"U9*U10","v":428026.452093}]
[null,"Unequalized Ref",null,null,null,null,null,null,0,0,null,null,null,4197166500,{"$f":"N13","v":967451278}]
[null,"Adjustments",null,null,null,null,null,null,0,0,null,null,"Est. RMV",967451278,{"$f":"'RMV History'!C11","v":4895294300},null,null,null,null,null,{"$f":"U11-F9","v":428026.452093}]
[null,"Other Offsets",null,null,null,null,null,null,0,0,null,null,"Authority per Pupil Unit",300,300]
[null,"Total",{"$f":"SUM(C9:C14)","v":0},null,null,{"$f":"SUM(F9:F14)","v":0},null,null,0,0,null,null,"Est. Revenue",{"$f":"N10*N14","v":2707920},{"$f":"O10*O14","v":2748600}]
[null,null,null,null,null,null,null,null,null,null,null,null,"Est. Aid",{"$f":"N15-(MIN(N14,300)*N10*MIN((($N12/N11)/880000),1)+IF(N14>760,(N14-760)*N10*MIN((($N12/N11)/290000),1),0)+MIN(760-300,N14-300)*N10*MIN((($N12/N11)/510000),1))","v":1381953.46457211},{"$f":"O15-(MIN(O14,300)*O10*MIN((($O12/O11)/880000),1)+IF(O14>760,(O14-760)*O10*MIN((($O12/O11)/290000),1),0)+MIN(760-300,O14-300)*O10*MIN((($O12/O11)/510000),1))","v":2447749.1321468721}]
["General RMV - Other -JOBZ Exempt","Local Optional",3340000.59,null,null,3534835.45,null,null,{"$f":"F17-C17","v":194834.86000000034},{"$f":"G17-D17","v":0},null,null,"Enter Hold Harmless Aid",0,0]
[null,"Equity",1319457.78,null,null,1387047.75,null,null,{"$f":"F18-C18","v":67589.969999999972},0,null,null,"Levy",{"$f":"N15-MAX(N16,N17)","v":1325966.53542789},{"$f":"O15-MAX(O16,O17)","v":300850.86785312789}]
[null,"Transition",148488.23000000001,null,null,157150.10999999999,null,null,8661.8799999999756,0,null,null,"RMV %",{"$f":"ROUND(N18/N13,7)","v":1.3706E-3},{"$f":"ROUND(O18/O13,7)","v":6.1500000000000004E-5}]
[null,"1st Tier Board Approved",1369586.43,null,null,1449479.58,null,null,79893.15000000014,0]
[null,"Adjustments",{"$f":"-35006.07-23353.23-1708.81-14354.44-56172.82-30032.05-2655.07-23033.98","v":-186316.47},null,null,{"$f":"354326.16+129846.65+15752.48+145293.48-85018.45-40538.79-3917.75-34862.29","v":480881.49},null,null,667197.96,0,null,"LOR","LOR per Pupil Unit",424,424]
[null,"Other Offsets",null,null,null,null,null,null,0,0,null,null,"Est. Revenue",{"$f":"N10*N21","v":3827193.5999999996},{"$f":"O10*O21","v":3884688}]
[null,"Total",{"$f":"SUM(C17:C22)","v":5991216.5600000005},null,null,{"$f":"SUM(F17:F22)","v":7009394.3800000008},null,null,1018177.8200000003,0,null,null,"Est. Aid",{"$f":"N22-(N22*MIN(((N12/N11)/510000),1))","v":593568.54314474296},{"$f":"O22-(O22*MIN(((O12/O11)/510000),1))","v":3151005.1515466725}]
[null,null,null,null,null,null,null,null,null,null,null,null,"Levy",{"$f":"N22-N23","v":3233625.0568552567},{"$f":"O22-O23","v":733682.84845332755}]
[null,"Total RMV",{"$f":"C15+C23","v":5991216.5600000005},null,null,{"$f":"F15+F23","v":7009394.3800000008},null,null,1018177.8200000003]
[]
["Gen NTC VA - JOBZ Exempt","Capital Project Referendum",3011717.06,null,null,3206596.1,null,null,{"$f":"F27-C27","v":194879.04000000004}]
[null,"Other NTC Voter Adj",null,null,null,null,null,null,{"$f":"F28-C28","v":0}]
[null,"Other Offsets",null,null,null,null,null,null,{"$f":"F29-C29","v":0}]
[null,"Total",{"$f":"SUM(C27:C29)","v":3011717.06},null,null,{"$f":"SUM(F27:F29)","v":3206596.1},null,null,{"$f":"F30-C30","v":194879.04000000004}]
[]
["Gen NTC Other Gen Ed - JOBZ Exempt","Student Achievement",74895.22,null,null,0,null,null,{"$f":"F32-C32","v":-74895.22}]
[null,"Other Adjustments",null,null,null,null,null,null,0]
[null,"Other Offsets",null,null,null,null,null,null,0]
[null,"Total",{"$f":"SUM(C32:C34)","v":74895.22},null,null,{"$f":"SUM(F32:F34)","v":0},null,null,-74895.22]
[]
["General NTC Other JOBZ Exempt","Operating Capital",568523.48,null,null,520376.76,null,null,-48146.719999999972]
[null,"Alt Teacher Comp",null,null,null,null,null,null,0]
[null,"Achievement & Integration",394027.71,null,null,406131.53,null,null,12103.820000000007]
[null,"Reemployment Ins",35000,null,null,40000,null,null,5000]
[null,"Safe Schools",329832,null,null,334260,null,null,4428]
[null,"Safe Schools Intermediate",null,null,null,null,null,null,0]
[null,"Judgment",null,null,null,null,null,null,0]
[null,"Ice Arena",null,null,null,null,null,null,0]
[null,"Career Technical",198920.52,null,null,234803.02,null,null,35882.5]
[null,"Annual OPEB",250000,null,null,150000,null,null,-100000]
[null,"LT Fac Equal",1323400.6599999999,null,null,1919588.8,null,null,596188.14000000013]
[null,"LT Fac Unequal",38820,null,null,48535.87,null,null,9715.8700000000026]
[null,"Disabled Access",null,null,null,null,null,null,0]
[null,"Building / Land Lease",1586818.82,null,null,1622044.82,null,null,35226]
[null,"Coop Building Repair",null,null,null,null,null,null,0]
[null,"Other Capital (Memo)",null,null,null,null,null,null,0]
[null,"Consolidation / Transition",null,null,null,null,null,null,0]
[null,"Reorg Operating Debt ",null,null,null,null,null,null,0]
[null,"Health Benefits",null,null,null,null,null,null,0]
[null,"Health Ins (Mpls)",null,null,null,null,null,null,0]
[null,"Additional Retirement",null,null,null,null,null,null,0]
[null,"Severance",null,null,null,null,null,null,0]
[null,"Adminstrative District",null,null,null,null,null,null,0]
[null,"Swimming Pool",null,null,null,null,null,null,0]
[null,"Tree Growth",null,null,null,null,null,null,0]
[null,"Consolidation / Retirement",null,null,null,null,null,null,0]
[null,"Economic Dev Abate",null,null,null,null,null,null,0]
[null,"Other General (Memo)",null,null,null,null,null,null,0]
[null,"Subtotal",{"$f":"SUM(C37:C64)","v":4725343.1900000004},null,null,{"$f":"SUM(F37:F64)","v":5275740.8000000007},null,null,550397.61000000034]
[null,"Other Adjustments",{"$f":"-171718.62+972.19-52.12","v":-170798.55},null,null,{"$f":"48904.5+98564.14-F67","v":87655.380000000019},null,null,258453.93]
[null,"Abatement Adjustments",{"$f":"78896.89+11098.31","v":89995.199999999997},null,null,{"$f":"36828.52+22984.74","v":59813.259999999995},null,null,-30181.940000000002]
[null,"Total",{"$f":"SUM(C65:C67)","v":4644539.8400000008},null,null,{"$f":"SUM(F65:F67)","v":5423209.4400000004},null,null,778669.59999999963]
[]
["Community Service JOBZ Exempt","Basic Community Educ",336903.5,null,null,340047.65,null,null,{"$f":"F70-C70","v":3144.1500000000233}]
[null,"Early Child Family",175258.03,null,null,183863.15,null,null,{"$f":"F71-C71","v":8605.1199999999953}]
[null,"Home Visitiing",4167.49,null,null,3961.31,null,null,-206.17999999999984]
[null,"Adults with Disabilities",null,null,null,null,null,null,0]
[null,"School-Age Care",60000,null,null,60000,null,null,0]
[null,"Other Adjustments",{"$f":"702.4+3376.29","v":4078.69},null,null,{"$f":"-163.7-607.54","v":-771.24},null,null,{"$f":"F75-C75","v":-4849.93}]
[null,"Abatement Adjustments",{"$f":"4968.03+667.44","v":5635.4699999999993},null,null,{"$f":"2353.82+1369.49","v":3723.3100000000004},null,null,-1912.1599999999989]
[null,"Total",{"$f":"SUM(C70:C76)","v":586043.17999999993},null,null,{"$f":"SUM(F70:F76)","v":590824.18000000017},null,null,4781.0000000002328]
[null,null,null,null,null,null,null,null,null,null,null,"Debt Aid Calc"]
["Debt Service Voter-Approved JOBZ Non-Exempt","Initial Debt Service",20155971.879999999,null,null,21393904.350000001,null,null,{"$f":"F79-C79","v":1237932.4700000025}]
[null,"Reduction for Debt Excess",-1179816.3400000001,null,null,{"$f":"-1100000.03","v":-1100000.03},null,null,79816.310000000056]
[null,"Other Adjust (Memo)",null,null,null,null,null,null,0]
[null,"Abatement Adjustments",{"$f":"13289.73+15221.64-0.04","v":28511.329999999998},null,null,{"$f":"12853.02+34446.09","v":47299.11},null,null,18787.780000000002]
[null,"Other Adjustments",null,null,null,null,null,null,0]
[null,"Total",{"$f":"SUM(C79:C83)","v":19004666.869999997},null,null,{"$f":"SUM(F79:F83)","v":20341203.43},null,null,1336536.5600000024]
[]
["Debt Service Other JOBZ Non-Exempt","Debt Service-Aid Elig",null,null,null,null,null,null,{"$f":"F86-C86","v":0}]
[null,"Debt Service-Aid InElig"]
[null,"LT Facilities Debt Service",null,null,null,null,null,null,0]
[null,"LTFM Debt Service Adjust",null,null,null,null,null,null,0]
[null,"Reduction for Debt Excess",-0.04,null,null,null,null,null,0.04]
[null,"Other Adjust (Memo)",null,null,null,null,null,null,0]
[null,"Abatement Adjustments",null,null,null,null,null,null,0]
[null,"Other Adjustments",0.04,null,null,null,null,null,-0.04]
[null,"Total",{"$f":"SUM(C86:C93)","v":0},null,null,{"$f":"SUM(F86:F93)","v":0},null,null,0]
[]
["OPEB / Pension Debt Service VA JOBZ Non-Exempt","Initial Debt Service",null,null,null,null,null,null,{"$f":"F96-C96","v":0}]
[null,"Reduction for Debt Excess",null,null,null,null,null,null,0]
[null,"Other Adjust (Memo)",null,null,null,null,null,null,0]
[null,"Abatement Adjustments",null,null,null,null,null,null,0]
[null,"Other Adjustments",null,null,null,null,null,null,0]
[null,"Total",{"$f":"SUM(C96:C100)","v":0},null,null,{"$f":"SUM(F96:F100)","v":0},null,null,0]
[]
["OPEB / Pension Debt Service Other JOBZ Non-Exempt","Initial Debt Service",null,null,null,null,null,null,{"$f":"F103-C103","v":0}]
[null,"Reduction for Debt Excess",null,null,null,null,null,null,0]
[null,"Other Adjust (Memo)",null,null,null,null,null,null,0]
[null,"Abatement Adjustments",null,null,null,null,null,null,0]
[null,"Other Adjustments",null,null,null,null,null,null,0]
[null,"Total",{"$f":"SUM(C103:C107)","v":0},null,null,{"$f":"SUM(F103:F107)","v":0},null,null,0]
[]
[null,"Total NTC",{"$f":"C30+C35+C68+C77+C84+C94+C101+C108","v":27321862.169999998},null,null,{"$f":"F30+F35+F68+F77+F84+F94+F101+F108","v":29561833.149999999},null,null,{"$f":"F110-C110","v":2239970.9800000004}]
[null,"Total NTC JOBZ Exempt",{"$f":"C110-C112","v":8317195.3000000007},null,null,{"$f":"F110-F112","v":9220629.7199999988},null,null,903434.41999999806]
[null,"Total NTC JOBZ Non-Exempt",{"$f":"C84+C94+C101+C108","v":19004666.869999997},null,null,{"$f":"F84+F94+F101+F108","v":20341203.43},null,null,1336536.5600000024]
[null,null,null,null,null,null,null,null,null,null,"% Change"]
["TOTAL LEVY SUMMARY","RMV",{"$f":"C25","v":5991216.5600000005},null,null,{"$f":"F25","v":7009394.3800000008},null,null,{"$f":"F114-C114","v":1018177.8200000003},null,{"$f":"I114/C114","v":0.16994508707927597}]
[null,"NTC",{"$f":"C110","v":27321862.169999998},null,null,{"$f":"F110","v":29561833.149999999},null,null,{"$f":"F115-C115","v":2239970.9800000004},null,{"$f":"I115/C115","v":8.1984564817091335E-2}]
[null,"Total Spread Levy",{"$f":"C114+C115","v":33313078.729999997},null,null,{"$f":"F114+F115","v":36571227.530000001},null,null,{"$f":"F116-C116","v":3258148.8000000045},null,{"$f":"I116/C116","v":9.7803893371941272E-2}]

{"sheet":"Scott Co Prelim Data","index":5,"n_rows":235,"n_cols":11,"rows_kept":235,"cut":false,"hidden":false,"merged":[]}
[]
[]
["School District","Unique Taxing Area","NTC or RMV","Classification Type","Value"]
[720,"TAG: 0801/JKSN TWP/ISD 720","Net Tax Capacity","100 Res 1 unit",756178]
[720,"TAG: 0801/JKSN TWP/ISD 720","Net Tax Capacity","140 Res V Land",26750]
[720,"TAG: 0801/JKSN TWP/ISD 720","Net Tax Capacity","200 Agricultural",98925]
[720,"TAG: 0801/JKSN TWP/ISD 720","Net Tax Capacity","300 Commercial",157050]
[720,"TAG: 0801/JKSN TWP/ISD 720","Net Tax Capacity","305 Industrial",45500]
[720,"TAG: 0801/JKSN TWP/ISD 720","Net Tax Capacity","320 Q Golf Course",5815]
[720,"TAG: 0801/JKSN TWP/ISD 720","Net Tax Capacity","350 MH Park",12619]
[720,"TAG: 0801/JKSN TWP/ISD 720","Net Tax Capacity","431 PP Tools & Mach",204,null,null,null,"School District Number","Fiscal Disparity NTC Levy Adjustments","Fiscal Disparity RMV Levy Adjustments"]
[720,"TAG: 0801/JKSN TWP/ISD 720","Net Tax Capacity","211 Rural Vacant Land",3980,null,null,null,"ISD 716","495,187*","123,761*"]
[720,"TAG: 0801/JKSN TWP/ISD 720","Net Tax Capacity","459 PP SA Gas Distrib Utility",63492,null,null,null,"ISD 717",495050,161752]
[720,"TAG: 0801/JKSN TWP/ISD 720","Net Tax Capacity","455 PP SA Gas Trans Pipeline",66,null,null,null,"ISD 720",3026162,663305]
[720,"TAG: 0801/JKSN TWP/ISD 720","Net Tax Capacity","453 PP Leased L/B",3600]
[720,"TAG: 0802/JKSN TWP/ISD 720/LOW MN","Net Tax Capacity","100 Res 1 unit",38610]
[720,"TAG: 0802/JKSN TWP/ISD 720/LOW MN","Net Tax Capacity","105 Res 2-3 units",3620]
[720,"TAG: 0802/JKSN TWP/ISD 720/LOW MN","Net Tax Capacity","140 Res V Land",142]
[720,"TAG: 0802/JKSN TWP/ISD 720/LOW MN","Net Tax Capacity","200 Agricultural",10469]
[720,"TAG: 0802/JKSN TWP/ISD 720/LOW MN","Net Tax Capacity","300 Commercial",165280]
[720,"TAG: 0802/JKSN TWP/ISD 720/LOW MN","Net Tax Capacity","305 Industrial",194704]
[720,"TAG: 0802/JKSN TWP/ISD 720/LOW MN","Net Tax Capacity","350 MH Park",58146]
[720,"TAG: 0802/JKSN TWP/ISD 720/LOW MN","Net Tax Capacity","355 Pub Util L & S",16102]
[720,"TAG: 0802/JKSN TWP/ISD 720/LOW MN","Net Tax Capacity","360 Pub Util RR",15638]
[720,"TAG: 0802/JKSN TWP/ISD 720/LOW MN","Net Tax Capacity","211 Rural Vacant Land",7254]
[720,"TAG: 0802/JKSN TWP/ISD 720/LOW MN","Net Tax Capacity","443 PP SA Elec Trans >= 69KV",89054]
[720,"TAG: 0802/JKSN TWP/ISD 720/LOW MN","Net Tax Capacity","459 PP SA Gas Distrib Utility",9918]
[720,"TAG: 0802/JKSN TWP/ISD 720/LOW MN","Net Tax Capacity","365 Pub Util Mach",266968]
[720,"TAG: 0904/LSVL TWP/ISD 720","Net Tax Capacity","100 Res 1 unit",1605084]
[720,"TAG: 0904/LSVL TWP/ISD 720","Net Tax Capacity","105 Res 2-3 units",4495]
[720,"TAG: 0904/LSVL TWP/ISD 720","Net Tax Capacity","110 Apt 4+ units",3574]
[720,"TAG: 0904/LSVL TWP/ISD 720","Net Tax Capacity","140 Res V Land",63201]
[720,"TAG: 0904/LSVL TWP/ISD 720","Net Tax Capacity","200 Agricultural",142318]
[720,"TAG: 0904/LSVL TWP/ISD 720","Net Tax Capacity","431 PP Tools & Mach",1488]
[720,"TAG: 0904/LSVL TWP/ISD 720","Net Tax Capacity","300 Commercial",156523]
[720,"TAG: 0904/LSVL TWP/ISD 720","Net Tax Capacity","305 Industrial",211579]
[720,"TAG: 0904/LSVL TWP/ISD 720","Net Tax Capacity","455 PP SA Gas Trans Pipeline",66]
[720,"TAG: 0904/LSVL TWP/ISD 720","Net Tax Capacity","451 PP Urban Bldg",1800]
[720,"TAG: 0904/LSVL TWP/ISD 720","Net Tax Capacity","252 Managed Forest Land",827]
[720,"TAG: 0904/LSVL TWP/ISD 720","Net Tax Capacity","211 Rural Vacant Land",23706]
[720,"TAG: 0904/LSVL TWP/ISD 720","Net Tax Capacity","459 PP SA Gas Distrib Utility",32764]
[720,"TAG: 0906/LSVL TWP/ISD 720/LOW MN","Net Tax Capacity","100 Res 1 unit",1373]
[720,"TAG: 0906/LSVL TWP/ISD 720/LOW MN","Net Tax Capacity","200 Agricultural",25709]
[720,"TAG: 0906/LSVL TWP/ISD 720/LOW MN","Net Tax Capacity","300 Commercial",204212]
[720,"TAG: 0906/LSVL TWP/ISD 720/LOW MN","Net Tax Capacity","305 Industrial",45821]
[720,"TAG: 0906/LSVL TWP/ISD 720/LOW MN","Net Tax Capacity","350 MH Park",5104]
[720,"TAG: 0906/LSVL TWP/ISD 720/LOW MN","Net Tax Capacity","355 Pub Util L & S",180]
[720,"TAG: 0906/LSVL TWP/ISD 720/LOW MN","Net Tax Capacity","360 Pub Util RR",26778]
[720,"TAG: 0906/LSVL TWP/ISD 720/LOW MN","Net Tax Capacity","211 Rural Vacant Land",17939]
[720,"TAG: 0906/LSVL TWP/ISD 720/LOW MN","Net Tax Capacity","443 PP SA Elec Trans >= 69KV",22194]
[720,"TAG: 0906/LSVL TWP/ISD 720/LOW MN","Net Tax Capacity","459 PP SA Gas Distrib Utility",15716]
[720,"TAG: 0906/LSVL TWP/ISD 720/LOW MN","Net Tax Capacity","365 Pub Util Mach",8952]
[720,"TAG: 1204/SC TWP/ISD 720/JDN FIRE","Net Tax Capacity","100 Res 1 unit",111583]
[720,"TAG: 1204/SC TWP/ISD 720/JDN FIRE","Net Tax Capacity","105 Res 2-3 units",1843]
[720,"TAG: 1204/SC TWP/ISD 720/JDN FIRE","Net Tax Capacity","200 Agricultural",158749]
[720,"TAG: 1204/SC TWP/ISD 720/JDN FIRE","Net Tax Capacity","300 Commercial",929]
[720,"TAG: 1204/SC TWP/ISD 720/JDN FIRE","Net Tax Capacity","455 PP SA Gas Trans Pipeline",36]
[720,"TAG: 1204/SC TWP/ISD 720/JDN FIRE","Net Tax Capacity","431 PP Tools & Mach",6548]
[720,"TAG: 1204/SC TWP/ISD 720/JDN FIRE","Net Tax Capacity","252 Managed Forest Land",1697]
[720,"TAG: 1204/SC TWP/ISD 720/JDN FIRE","Net Tax Capacity","211 Rural Vacant Land",2682]
[720,"TAG: 1204/SC TWP/ISD 720/JDN FIRE","Net Tax Capacity","459 PP SA Gas Distrib Utility",17452]
[720,"TAG: 1205/SC TWP/ISD 720/JDN FIRE","Net Tax Capacity","200 Agricultural",3672]
[720,"TAG: 2007/PL CITY/ISD 720/PLSPL WMO","Net Tax Capacity","100 Res 1 unit",279773]
[720,"TAG: 2007/PL CITY/ISD 720/PLSPL WMO","Net Tax Capacity","140 Res V Land",75184]
[720,"TAG: 2007/PL CITY/ISD 720/PLSPL WMO","Net Tax Capacity","200 Agricultural",31188]
[720,"TAG: 2007/PL CITY/ISD 720/PLSPL WMO","Net Tax Capacity","427 PP Elec Dist",138]
[720,"TAG: 2007/PL CITY/ISD 720/PLSPL WMO","Net Tax Capacity","431 PP Tools & Mach",14228]
[720,"TAG: 2007/PL CITY/ISD 720/PLSPL WMO","Net Tax Capacity","211 Rural Vacant Land",5155]
[720,"TAG: 2007/PL CITY/ISD 720/PLSPL WMO","Net Tax Capacity","443 PP SA Elec Trans >= 69KV",3972]
[720,"TAG: 2007/PL CITY/ISD 720/PLSPL WMO","Net Tax Capacity","459 PP SA Gas Distrib Utility",19822]
[720,"TAG: 2007/PL CITY/ISD 720/PLSPL WMO","Net Tax Capacity","451 PP Urban Bldg",1918]
[720,"TAG: 2010/PL CITY/ISD 720","Net Tax Capacity","100 Res 1 unit",278907]
[720,"TAG: 2010/PL CITY/ISD 720","Net Tax Capacity","140 Res V Land",39992]
[720,"TAG: 2010/PL CITY/ISD 720","Net Tax Capacity","211 Rural Vacant Land",53564]
[720,"TAG: 2010/PL CITY/ISD 720","Net Tax Capacity","200 Agricultural",29309]
[720,"TAG: 2011/PL CITY/ISD 720","Net Tax Capacity","100 Res 1 unit",37110]
[720,"TAG: 2011/PL CITY/ISD 720","Net Tax Capacity","140 Res V Land",1336]
[720,"TAG: 2011/PL CITY/ISD 720","Net Tax Capacity","200 Agricultural",570]
[720,"TAG: 2109/SVG CITY/ISD 720/LOW MN","Net Tax Capacity","100 Res 1 unit",1022283]
[720,"TAG: 2109/SVG CITY/ISD 720/LOW MN","Net Tax Capacity","140 Res V Land",19]
[720,"TAG: 2109/SVG CITY/ISD 720/LOW MN","Net Tax Capacity","305 Industrial",279250]
[720,"TAG: 2109/SVG CITY/ISD 720/LOW MN","Net Tax Capacity","443 PP SA Elec Trans >= 69KV",1356]
[720,"TAG: 2109/SVG CITY/ISD 720/LOW MN","Net Tax Capacity","459 PP SA Gas Distrib Utility",9368]
[720,"TAG: 2109/SVG CITY/ISD 720/LOW MN","Net Tax Capacity","427 PP Elec Dist",68]
[720,"TAG: 2110/SVG CITY/ISD 720/PLSPL WM","Net Tax Capacity","100 Res 1 unit",926174]
[720,"TAG: 2110/SVG CITY/ISD 720/PLSPL WM","Net Tax Capacity","140 Res V Land",375]
[720,"TAG: 2110/SVG CITY/ISD 720/PLSPL WM","Net Tax Capacity","453 PP Leased L/B",5700]
[720,"TAG: 2204/SHK CITY/ISD 720/LOW MN","Net Tax Capacity","100 Res 1 unit",15842510]
[720,"TAG: 2204/SHK CITY/ISD 720/LOW MN","Net Tax Capacity","105 Res 2-3 units",97186]
[720,"TAG: 2204/SHK CITY/ISD 720/LOW MN","Net Tax Capacity","110 Apt 4+ units",2215628]
[720,"TAG: 2204/SHK CITY/ISD 720/LOW MN","Net Tax Capacity","140 Res V Land",68170]
[720,"TAG: 2204/SHK CITY/ISD 720/LOW MN","Net Tax Capacity","200 Agricultural",155202]
[720,"TAG: 2204/SHK CITY/ISD 720/LOW MN","Net Tax Capacity","300 Commercial",7907318]
[720,"TAG: 2204/SHK CITY/ISD 720/LOW MN","Net Tax Capacity","305 Industrial",12127434]
[720,"TAG: 2204/SHK CITY/ISD 720/LOW MN","Net Tax Capacity","335 Comm Services-Non Revenue",959]
[720,"TAG: 2204/SHK CITY/ISD 720/LOW MN","Net Tax Capacity","350 MH Park",7670]
[720,"TAG: 2204/SHK CITY/ISD 720/LOW MN","Net Tax Capacity","355 Pub Util L & S",16574]
[720,"TAG: 2204/SHK CITY/ISD 720/LOW MN","Net Tax Capacity","360 Pub Util RR",206185]
[720,"TAG: 2204/SHK CITY/ISD 720/LOW MN","Net Tax Capacity","365 Pub Util Mach",33424]
[720,"TAG: 2204/SHK CITY/ISD 720/LOW MN","Net Tax Capacity","370 Pub Util El Gen Mach",236522]
[720,"TAG: 2204/SHK CITY/ISD 720/LOW MN","Net Tax Capacity","431 PP Tools & Mach",2954]
[720,"TAG: 2204/SHK CITY/ISD 720/LOW MN","Net Tax Capacity","427 PP Elec Dist",21442]
[720,"TAG: 2204/SHK CITY/ISD 720/LOW MN","Net Tax Capacity","455 PP SA Gas Trans Pipeline",33]
[720,"TAG: 2204/SHK CITY/ISD 720/LOW MN","Net Tax Capacity","438 PP Comm Bldg",49000]
[720,"TAG: 2204/SHK CITY/ISD 720/LOW MN","Net Tax Capacity","451 PP Urban Bldg",2120]
[720,"TAG: 2204/SHK CITY/ISD 720/LOW MN","Net Tax Capacity","336 Comm Services-Donations",1695]
[720,"TAG: 2204/SHK CITY/ISD 720/LOW MN","Net Tax Capacity","453 PP Leased L/B",2850]
[720,"TAG: 2204/SHK CITY/ISD 720/LOW MN","Net Tax Capacity","211 Rural Vacant Land",9980]
[720,"TAG: 2204/SHK CITY/ISD 720/LOW MN","Net Tax Capacity","443 PP SA Elec Trans >= 69KV",65096]
[720,"TAG: 2204/SHK CITY/ISD 720/LOW MN","Net Tax Capacity","459 PP SA Gas Distrib Utility",348340]
[720,"TAG: 2206/SHK CITY/ISD 720","Net Tax Capacity","100 Res 1 unit",10778616]
[720,"TAG: 2206/SHK CITY/ISD 720","Net Tax Capacity","105 Res 2-3 units",14401]
[720,"TAG: 2206/SHK CITY/ISD 720","Net Tax Capacity","110 Apt 4+ units",143125]
[720,"TAG: 2206/SHK CITY/ISD 720","Net Tax Capacity","140 Res V Land",97986]
[720,"TAG: 2206/SHK CITY/ISD 720","Net Tax Capacity","200 Agricultural",313649]
[720,"TAG: 2206/SHK CITY/ISD 720","Net Tax Capacity","431 PP Tools & Mach",2]
[720,"TAG: 2206/SHK CITY/ISD 720","Net Tax Capacity","211 Rural Vacant Land",51915]
[720,"TAG: 2206/SHK CITY/ISD 720","Net Tax Capacity","300 Commercial",1213262]
[720,"TAG: 2206/SHK CITY/ISD 720","Net Tax Capacity","305 Industrial",73938]
[720,"TAG: 2206/SHK CITY/ISD 720","Net Tax Capacity","320 Q Golf Course",23155]
[720,"TAG: 2208/SHK CITY/ISD 720/PLSPL WM","Net Tax Capacity","100 Res 1 unit",794236]
[720,"TAG: 2208/SHK CITY/ISD 720/PLSPL WM","Net Tax Capacity","140 Res V Land",1876]
[720,"TAG: 2208/SHK CITY/ISD 720/PLSPL WM","Net Tax Capacity","200 Agricultural",47098]
[720,"TAG: 2208/SHK CITY/ISD 720/PLSPL WM","Net Tax Capacity","211 Rural Vacant Land",181]
[null,null,null,null,{"$f":"SUM(E4:E124)","v":61065169}]
[]
[]
[720,"TAG: 0801/JKSN TWP/ISD 720","RMV","453 PP Leased L/B",240000]
[720,"TAG: 0801/JKSN TWP/ISD 720","RMV","455 PP SA Gas Trans Pipeline",4400]
[720,"TAG: 0801/JKSN TWP/ISD 720","RMV","459 PP SA Gas Distrib Utility",3174600]
[720,"TAG: 0801/JKSN TWP/ISD 720","RMV","431 PP Tools & Mach",10200]
[720,"TAG: 0801/JKSN TWP/ISD 720","RMV","350 MH Park",1009500]
[720,"TAG: 0801/JKSN TWP/ISD 720","RMV","320 Q Golf Course",465000]
[720,"TAG: 0801/JKSN TWP/ISD 720","RMV","305 Industrial",2350000]
[720,"TAG: 0801/JKSN TWP/ISD 720","RMV","300 Commercial",8342100]
[720,"TAG: 0801/JKSN TWP/ISD 720","RMV","200 Agricultural",2467500]
[720,"TAG: 0801/JKSN TWP/ISD 720","RMV","140 Res V Land",2139800]
[720,"TAG: 0801/JKSN TWP/ISD 720","RMV","100 Res 1 unit",75717300]
[720,"TAG: 0802/JKSN TWP/ISD 720/LOW MN","RMV","365 Pub Util Mach",13348400]
[720,"TAG: 0802/JKSN TWP/ISD 720/LOW MN","RMV","459 PP SA Gas Distrib Utility",495900]
[720,"TAG: 0802/JKSN TWP/ISD 720/LOW MN","RMV","443 PP SA Elec Trans >= 69KV",4452700]
[720,"TAG: 0802/JKSN TWP/ISD 720/LOW MN","RMV","360 Pub Util RR",781900]
[720,"TAG: 0802/JKSN TWP/ISD 720/LOW MN","RMV","355 Pub Util L & S",805100]
[720,"TAG: 0802/JKSN TWP/ISD 720/LOW MN","RMV","350 MH Park",4651600]
[720,"TAG: 0802/JKSN TWP/ISD 720/LOW MN","RMV","305 Industrial",10544700]
[720,"TAG: 0802/JKSN TWP/ISD 720/LOW MN","RMV","300 Commercial",8680700]
[720,"TAG: 0802/JKSN TWP/ISD 720/LOW MN","RMV","200 Agricultural",153700]
[720,"TAG: 0802/JKSN TWP/ISD 720/LOW MN","RMV","140 Res V Land",11300]
[720,"TAG: 0802/JKSN TWP/ISD 720/LOW MN","RMV","105 Res 2-3 units",289600]
[720,"TAG: 0802/JKSN TWP/ISD 720/LOW MN","RMV","100 Res 1 unit",3942900]
[720,"TAG: 0904/LSVL TWP/ISD 720","RMV","459 PP SA Gas Distrib Utility",1638200]
[720,"TAG: 0904/LSVL TWP/ISD 720","RMV","451 PP Urban Bldg",90000]
[720,"TAG: 0904/LSVL TWP/ISD 720","RMV","455 PP SA Gas Trans Pipeline",4400]
[720,"TAG: 0904/LSVL TWP/ISD 720","RMV","305 Industrial",10890200]
[720,"TAG: 0904/LSVL TWP/ISD 720","RMV","300 Commercial",8373700]
[720,"TAG: 0904/LSVL TWP/ISD 720","RMV","431 PP Tools & Mach",74400]
[720,"TAG: 0904/LSVL TWP/ISD 720","RMV","200 Agricultural",1896600]
[720,"TAG: 0904/LSVL TWP/ISD 720","RMV","140 Res V Land",5056100]
[720,"TAG: 0904/LSVL TWP/ISD 720","RMV","110 Apt 4+ units",323100]
[720,"TAG: 0904/LSVL TWP/ISD 720","RMV","105 Res 2-3 units",449500]
[720,"TAG: 0904/LSVL TWP/ISD 720","RMV","100 Res 1 unit",158839700]
[720,"TAG: 0906/LSVL TWP/ISD 720/LOW MN","RMV","365 Pub Util Mach",447600]
[720,"TAG: 0906/LSVL TWP/ISD 720/LOW MN","RMV","459 PP SA Gas Distrib Utility",785800]
[720,"TAG: 0906/LSVL TWP/ISD 720/LOW MN","RMV","443 PP SA Elec Trans >= 69KV",1109700]
[720,"TAG: 0906/LSVL TWP/ISD 720/LOW MN","RMV","360 Pub Util RR",1338900]
[720,"TAG: 0906/LSVL TWP/ISD 720/LOW MN","RMV","355 Pub Util L & S",9000]
[720,"TAG: 0906/LSVL TWP/ISD 720/LOW MN","RMV","350 MH Park",408300]
[720,"TAG: 0906/LSVL TWP/ISD 720/LOW MN","RMV","305 Industrial",2464900]
[720,"TAG: 0906/LSVL TWP/ISD 720/LOW MN","RMV","300 Commercial",10549500]
[720,"TAG: 0906/LSVL TWP/ISD 720/LOW MN","RMV","200 Agricultural",272400]
[720,"TAG: 0906/LSVL TWP/ISD 720/LOW MN","RMV","100 Res 1 unit",137300]
[720,"TAG: 1204/SC TWP/ISD 720/JDN FIRE","RMV","459 PP SA Gas Distrib Utility",872600]
[720,"TAG: 1204/SC TWP/ISD 720/JDN FIRE","RMV","431 PP Tools & Mach",327400]
[720,"TAG: 1204/SC TWP/ISD 720/JDN FIRE","RMV","455 PP SA Gas Trans Pipeline",2400]
[720,"TAG: 1204/SC TWP/ISD 720/JDN FIRE","RMV","300 Commercial",61900]
[720,"TAG: 1204/SC TWP/ISD 720/JDN FIRE","RMV","200 Agricultural",4497600]
[720,"TAG: 1204/SC TWP/ISD 720/JDN FIRE","RMV","105 Res 2-3 units",147400]
[720,"TAG: 1204/SC TWP/ISD 720/JDN FIRE","RMV","100 Res 1 unit",11333400]
[720,"TAG: 2007/PL CITY/ISD 720/PLSPL WMO","RMV","451 PP Urban Bldg",95900]
[720,"TAG: 2007/PL CITY/ISD 720/PLSPL WMO","RMV","459 PP SA Gas Distrib Utility",991100]
[720,"TAG: 2007/PL CITY/ISD 720/PLSPL WMO","RMV","443 PP SA Elec Trans >= 69KV",198600]
[720,"TAG: 2007/PL CITY/ISD 720/PLSPL WMO","RMV","431 PP Tools & Mach",711400]
[720,"TAG: 2007/PL CITY/ISD 720/PLSPL WMO","RMV","427 PP Elec Dist",6900]
[720,"TAG: 2007/PL CITY/ISD 720/PLSPL WMO","RMV","140 Res V Land",6013600]
[720,"TAG: 2007/PL CITY/ISD 720/PLSPL WMO","RMV","100 Res 1 unit",27927900]
[720,"TAG: 2010/PL CITY/ISD 720","RMV","200 Agricultural",203300]
[720,"TAG: 2010/PL CITY/ISD 720","RMV","140 Res V Land",3199400]
[720,"TAG: 2010/PL CITY/ISD 720","RMV","100 Res 1 unit",29348900]
[720,"TAG: 2011/PL CITY/ISD 720","RMV","140 Res V Land",106900]
[720,"TAG: 2011/PL CITY/ISD 720","RMV","100 Res 1 unit",3710700]
[720,"TAG: 2109/SVG CITY/ISD 720/LOW MN","RMV","427 PP Elec Dist",3400]
[720,"TAG: 2109/SVG CITY/ISD 720/LOW MN","RMV","459 PP SA Gas Distrib Utility",468400]
[720,"TAG: 2109/SVG CITY/ISD 720/LOW MN","RMV","443 PP SA Elec Trans >= 69KV",67800]
[720,"TAG: 2109/SVG CITY/ISD 720/LOW MN","RMV","305 Industrial",14000000]
[720,"TAG: 2109/SVG CITY/ISD 720/LOW MN","RMV","140 Res V Land",1500]
[720,"TAG: 2109/SVG CITY/ISD 720/LOW MN","RMV","100 Res 1 unit",105513100]
[720,"TAG: 2110/SVG CITY/ISD 720/PLSPL WM","RMV","453 PP Leased L/B",360000]
[720,"TAG: 2110/SVG CITY/ISD 720/PLSPL WM","RMV","140 Res V Land",30000]
[720,"TAG: 2110/SVG CITY/ISD 720/PLSPL WM","RMV","100 Res 1 unit",93694500]
[720,"TAG: 2204/SHK CITY/ISD 720/LOW MN","RMV","459 PP SA Gas Distrib Utility",17417000]
[720,"TAG: 2204/SHK CITY/ISD 720/LOW MN","RMV","443 PP SA Elec Trans >= 69KV",3254800]
[720,"TAG: 2204/SHK CITY/ISD 720/LOW MN","RMV","453 PP Leased L/B",180000]
[720,"TAG: 2204/SHK CITY/ISD 720/LOW MN","RMV","336 Comm Services-Donations",113000]
[720,"TAG: 2204/SHK CITY/ISD 720/LOW MN","RMV","451 PP Urban Bldg",141000]
[720,"TAG: 2204/SHK CITY/ISD 720/LOW MN","RMV","438 PP Comm Bldg",2450000]
[720,"TAG: 2204/SHK CITY/ISD 720/LOW MN","RMV","455 PP SA Gas Trans Pipeline",2200]
[720,"TAG: 2204/SHK CITY/ISD 720/LOW MN","RMV","427 PP Elec Dist",1072100]
[720,"TAG: 2204/SHK CITY/ISD 720/LOW MN","RMV","431 PP Tools & Mach",147700]
[720,"TAG: 2204/SHK CITY/ISD 720/LOW MN","RMV","370 Pub Util El Gen Mach",11826100]
[720,"TAG: 2204/SHK CITY/ISD 720/LOW MN","RMV","365 Pub Util Mach",1671200]
[720,"TAG: 2204/SHK CITY/ISD 720/LOW MN","RMV","360 Pub Util RR",10432800]
[720,"TAG: 2204/SHK CITY/ISD 720/LOW MN","RMV","355 Pub Util L & S",828700]
[720,"TAG: 2204/SHK CITY/ISD 720/LOW MN","RMV","350 MH Park",613600]
[720,"TAG: 2204/SHK CITY/ISD 720/LOW MN","RMV","335 Comm Services-Non Revenue",63900]
[720,"TAG: 2204/SHK CITY/ISD 720/LOW MN","RMV","305 Industrial",611534600]
[720,"TAG: 2204/SHK CITY/ISD 720/LOW MN","RMV","300 Commercial",404315500]
[720,"TAG: 2204/SHK CITY/ISD 720/LOW MN","RMV","200 Agricultural",220800]
[720,"TAG: 2204/SHK CITY/ISD 720/LOW MN","RMV","140 Res V Land",5495500]
[720,"TAG: 2204/SHK CITY/ISD 720/LOW MN","RMV","110 Apt 4+ units",181948200]
[720,"TAG: 2204/SHK CITY/ISD 720/LOW MN","RMV","105 Res 2-3 units",8402300]
[720,"TAG: 2204/SHK CITY/ISD 720/LOW MN","RMV","100 Res 1 unit",1693585400]
[720,"TAG: 2206/SHK CITY/ISD 720","RMV","320 Q Golf Course",1852300]
[720,"TAG: 2206/SHK CITY/ISD 720","RMV","305 Industrial",3809400]
[720,"TAG: 2206/SHK CITY/ISD 720","RMV","300 Commercial",61395000]
[720,"TAG: 2206/SHK CITY/ISD 720","RMV","431 PP Tools & Mach",100]
[720,"TAG: 2206/SHK CITY/ISD 720","RMV","200 Agricultural",3049100]
[720,"TAG: 2206/SHK CITY/ISD 720","RMV","140 Res V Land",7838000]
[720,"TAG: 2206/SHK CITY/ISD 720","RMV","110 Apt 4+ units",11450000]
[720,"TAG: 2206/SHK CITY/ISD 720","RMV","105 Res 2-3 units",1206400]
[720,"TAG: 2206/SHK CITY/ISD 720","RMV","100 Res 1 unit",1115810700]
[720,"TAG: 2208/SHK CITY/ISD 720/PLSPL WM","RMV","200 Agricultural",319500]
[720,"TAG: 2208/SHK CITY/ISD 720/PLSPL WM","RMV","140 Res V Land",150000]
[720,"TAG: 2208/SHK CITY/ISD 720/PLSPL WM","RMV","100 Res 1 unit",79498300]
[]
[null,null,null,null,{"$f":"SUM(E128:E233)","v":4895229400}]

{"sheet":"720","index":6,"n_rows":92,"n_cols":29,"rows_kept":92,"cut":false,"hidden":false,"merged":[[20,9,20,10],[23,1,25,8],[25,23,25,24],[25,25,25,28],[26,11,26,13],[26,14,26,16],[14,9,14,10],[15,9,15,10],[16,9,16,10],[17,9,17,10],[18,9,18,10],[19,9,19,10],[0,0,0,7],[2,8,2,10],[6,23,6,24],[9,9,9,10],[11,8,11,10],[13,9,13,10],[13,23,13,24]]}
["WHAT IF TAX COMPARISON PAY 2018 vs Pay 2017- ISD 720"]
[]
["   FISCAL YEAR 2017",null,null,null,null,null,null,null,"MARKET VALUE TAX"]
[]
[57005238,"TAX CAPACITY",null,null,27321862,"FINAL CERTIFIED LEVY",null,null,4606879600,"Referendum Market Value"]
[-827765,"TIF (-)",null,null,null,null,null,null,5991217,"CERTIFIED LEVY"]
[-7230486,"FISCAL DISPARITY (-)",null,null,-3200015,"FISCAL DISPARITY (-)",null,null,-703983,"FISCAL DISPARITY (-)"]
[{"$f":"SUM(A5:A7)","v":48946987},"NET TAX CAPACITY",null,null,{"$f":"SUM(E5:E7)","v":24121847},"TAX LEVY OR SPREAD LEVY",null,null,{"$f":"I7+I6","v":5287234},"Tax Levy or Spread Levy "]
[]
[null,null,null,"Tax Rate",{"$f":"E8/A8","v":0.49281576821061529},null,null,null,{"$f":"I8/I5","v":1.1476822619805387E-3},"Tax Rate"]
[]
["   FISCAL YEAR 2018",null,null,null,null,null,null,null,"MARKET VALUE TAX"]
[]
[61060558,"TAX CAPACITY",null,null,29561834,"PROPOSED LEVY OR CERTIFIED LEVY"]
[-1334699,"TIF (-)",null,null,null,null,null,null,4895294300,"Referendum Market Value",null,null,null,null,null,null,null,null,{"$f":"(I15-I5)/I5","v":6.2605217640157126E-2}]
[-8622977,"FISCAL DISPARITY (-)",null,null,-3026162,"FISCAL DISPARITY (-)",null,null,7009394,"CERTIFIED LEVY"]
[{"$f":"SUM(A14:A16)","v":51102882},"NET TAX CAPACITY",null,null,{"$f":"SUM(E14:E16)","v":26535672},"TAX LEVY OR SPREAD LEVY",null,null,-663305,"FISCAL DISPARITY (-)"]
[null,null,null,null,null,null,null,null,{"$f":"I16+I17","v":6346089},"Tax Levy or Spread Levy ",null,null,null,null,null,null,null,null,{"$f":"(A17-A8)/A8","v":4.4045509890118469E-2}]
[]
[]
[null,null,null,"Tax Rate",{"$f":"E17/A17","v":0.51925979438889569},null,null,null,{"$f":"I18/I15","v":1.2963651643987982E-3},"Tax Rate"]
[]
["RESIDENTIAL IMPACTS"]
[null,"All townships and cities that fall within the boundaries of ISD 720 are shown below. \nTo gauge the impact of the levy, input the proposed Levy Amounts in the red highlighted fields in the Fiscal Year 2018 section above.  ***Fiscal Year 2018 tax capacity and values are current as of 10/27/17."]
[]
[null,null,null,null,null,null,null,null,null,null,null,null,null,null,null,null,null,"Pay 2017","Pay 2017","Pay 2017","Pay 2018","Pay 2018","Pay 2018",null,null,"Median & Average Values"]
[null,null,null,null,"Average","Average","Value","Taxable","Value","Taxable",null,"Net Tax Capacity",null,null,"Net Tax Capacity",null,null,"Net","MV Tax","Net","Net","MV Tax ","Net","Net","Net",2017,2018,2018,2018]
[null,"% Value Range",null,"# of affected","Market Value","Market Value","Exclusion","Market Value","Exclusion","Market Value","Taxable %",2017,2017,"Total",2018,2018,"Total","Payable","Payable","Payable","Payable","Payable","Payable","Inc/Dec","Difference","Median ","Median","Average","Value "]
[null,"Inc/Dec",null,"Properties",2017,2018,2017,2017,2018,2018,"Chg 17-18",0.01,1.2500000000000001E-2,2017,0.01,1.2500000000000001E-2,2018,2017,2017,2017,2018,2018,2018,"17 vs 18","% Change","Values","Values","Values","% Change"]
["Jackson","+15.01+%","A",9,359300,{"$f":"E30*1.15","v":413194.99999999994},{"$f":"IF(E30<413800,(30400-((E30-76000)*9%)),0)","v":4903},{"$f":"E30-G30","v":354397},{"$f":"IF(F30<413800,(30400-((F30-76000)*9%)),0)","v":52.450000000008004},{"$f":"F30-I30","v":413142.54999999993},{"$f":"((J30-H30)/H30)","v":0.16576198444117735},{"$f":"IF(H30>500000,(500000*L$29),(H30*L$29))","v":3543.9700000000003},{"$f":"IF(E30<500000,0,(E30-500000)*M$29)","v":0},{"$f":"SUM(L30:M30)","v":3543.9700000000003},{"$f":"IF(J30>500000,(500000*O$29),(J30*O$29))","v":4131.4254999999994},{"$f":"IF(J30<500000,0,(J30-500000)*P$29)","v":0},{"$f":"SUM(O30:P30)","v":4131.4254999999994},{"$f":"N30*$E$10","v":1746.5242980653743},{"$f":"E30*I10","v":412.36223672960756},{"$f":"SUM(R30:S30)","v":2158.8865347949818},{"$f":"Q30*$E$21","v":2145.2831556630404},{"$f":"F30*I21","v":535.65160410376131},{"$f":"SUM(U30:V30)","v":2680.9347597668016},{"$f":"U30-R30","v":398.75885759766606},{"$f":"X30/R30","v":0.22831566559902511},328000,321000,347400,{"$f":"((AA30-Z30)/Z30)","v":-2.1341463414634148E-2}]
[{"$f":"SUM(D30:D38)","v":225},"+10.01-15.00%","B",1,{"$f":"E30","v":359300},{"$f":"E31*1.125","v":404212.5},4903,354397,860.875,403351.625,0.13813498703431462,3543.9700000000003,0,3543.9700000000003,4033.5162500000001,0,4033.5162500000001,1746.5242980653743,{"$f":"E31*$I$10","v":412.36223672960756},{"$f":"SUM(R31:S31)","v":2158.8865347949818},2094.4428186392697,{"$f":"F31*$I$21","v":524.00700401454924},{"$f":"SUM(U31:V31)","v":2618.449822653819},{"$f":"U31-R31","v":347.91852057389542},0.19920622974400351]
[null,"+5.01-10.00%","C",13,{"$f":"E31","v":359300},{"$f":"E32*1.075","v":386247.5},4903,354397,2477.7250000000022,383769.77500000002,8.2880992220588839E-2,3543.9700000000003,0,3543.9700000000003,3837.6977500000003,0,3837.6977500000003,1746.5242980653743,{"$f":"E32*$I$10","v":412.36223672960756},2158.8865347949818,1992.7621445917277,{"$f":"F32*$I$21","v":500.7178038361248},2493.4799484278524,246.23784652635345,0.14098735803395993]
[null,"+0.01-5.00%","D",57,359300,{"$f":"E33*1.02","v":366486},4903,354397,4256.260000000002,362229.74,2.2101597925490313E-2,3543.9700000000003,0,3543.9700000000003,3622.2973999999999,0,3622.2973999999999,1746.5242980653743,412.36223672960756,2158.8865347949818,1880.9134031394315,475.09968363985797,2356.0130867792896,134.38910507405717,7.6946599152911896E-2]
[null,"No Change","E",24,359300,{"$f":"E34","v":359300},4903,354397,4903,354397,0,3543.9700000000003,0,3543.9700000000003,3543.9700000000003,0,3543.9700000000003,1746.5242980653743,412.36223672960756,2158.8865347949818,1840.2411335204147,465.78400356848823,2306.0251370889027,93.716835455040382,5.3659050468894458E-2]
[null,"-0.01-5.00%","F",94,359300,{"$f":"((E35-(E35*2.5%)))","v":350317.5},4903,354397,5711.4249999999993,344606.07500000001,-2.7626997406862891E-2,3543.9700000000003,0,3543.9700000000003,3446.0607500000001,0,3446.0607500000001,1746.5242980653743,412.36223672960756,2158.8865347949818,1789.4007964966438,454.13940347927598,2243.5401999759197,42.876498431269511,2.4549614613872721E-2]
[null,"-5.01-10%","F",27,359300,{"$f":"((E36-(E36*7.5%)))","v":332352.5},4903,354397,7328.2750000000015,325024.22499999998,-8.2880992220588839E-2,3543.9700000000003,0,3543.9700000000003,3250.2422499999998,0,3250.2422499999998,1746.5242980653743,412.36223672960756,2158.8865347949818,1687.7201224491016,430.8502033008516,2118.5703257499531,-58.804175616272687,-3.3669257096171003E-2]
[null,"-10.01-15%","G",0,359300,{"$f":"((E37-(E37*12.5%)))","v":314387.5},4903,354397,8945.125,305442.375,-0.13813498703431462,3543.9700000000003,0,3543.9700000000003,3054.4237499999999,0,3054.4237499999999,1746.5242980653743,412.36223672960756,2158.8865347949818,1586.0394484015596,407.56100312242717,1993.6004515239867,-160.48484966381466,-9.1888128806214608E-2]
[null,"-15.01+","G",0,359300,{"$f":"((E38-(E38*15%)))","v":305405},4903,354397,9753.5499999999993,295651.45,-0.16576198444117751,3543.9700000000003,0,3543.9700000000003,2956.5145000000002,0,2956.5145000000002,1746.5242980653743,412.36223672960756,2158.8865347949818,1535.1991113777888,395.91640303321498,1931.1155144110037,-211.32518668758553,-0.12099756466123633]
[]
["Louisville","+15.01+%","A",11,419100,{"$f":"E40*1.15","v":481964.99999999994},0,419100,{"$f":"IF(F40<413800,(30400-((F40-76000)*9%)),0)","v":0},481964.99999999994,0.14999999999999986,4191,0,4191,4819.6499999999996,0,4819.6499999999996,2065.3908845706887,480.99363599604379,2546.3845205667326,{"$f":"Q40*$E$21","v":2502.6504680264411},624.80263645946673,3127.4531044859077,437.25958345575236,0.21170790803922859,407800,400800,412400,{"$f":"((AA40-Z40)/Z40)","v":-1.7165277096615989E-2}]
[{"$f":"SUM(D40:D48)","v":404},"+10.01-15.00%","B",25,{"$f":"E40","v":419100},{"$f":"E41*1.125","v":471487.5},0,419100,0,471487.5,0.125,4191,0,4191,4714.875,0,4714.875,2065.3908845706887,480.99363599604379,2546.3845205667326,2448.2450230693444,611.21997044947841,3059.4649935188227,382.85413849865563,0.18536643177750614]
[null,"+5.01-10.00%","C",68,{"$f":"E40","v":419100},{"$f":"E42*1.075","v":450532.5},0,419100,0,450532.5,7.4999999999999997E-2,4191,0,4191,4505.3249999999998,0,4505.3249999999998,2065.3908845706887,480.99363599604379,2546.3845205667326,2339.4341331551514,584.05463842950155,2923.488771584653,274.04324858446262,0.13268347925406146]
[null,"+0.01-5.00%","D",35,{"$f":"E40","v":419100},{"$f":"E43*1.02","v":427482},0,419100,0,427482,0.02,4191,0,4191,4274.82,0,4274.82,2065.3908845706887,480.99363599604379,2546.3845205667326,2219.742154249539,554.17277320752703,2773.9149274570659,154.35126967885026,7.4732231478272279E-2]
[null,"No Change","E",1,{"$f":"E40","v":419100},{"$f":"E44","v":419100},0,419100,0,419100,0,4191,0,4191,4191,0,4191,2065.3908845706887,480.99363599604379,2546.3845205667326,2176.2177982838616,543.30664039953638,2719.5244386833979,110.82691371317287,5.3659050468894319E-2]
[null,"-0.01-5.00%","F",131,{"$f":"E40","v":419100},{"$f":"((E45-(E45*2.5%)))","v":408622.5},0,419100,463.97500000000218,408158.52500000002,-2.6107074683846283E-2,4191,0,4191,4081.5852500000005,0,4081.5852500000005,2065.3908845706887,480.99363599604379,2546.3845205667326,2119.4031176957496,529.72397438954795,2649.1270920852976,54.012233125060902,2.6151094946992498E-2]
[null,"-5.01-10%","G",107,{"$f":"E40","v":419100},{"$f":"((E46-(E46*7.5%)))","v":387667.5},0,419100,2349.9249999999993,385317.57500000001,-8.0607074683846314E-2,4191,0,4191,3853.1757500000003,0,3853.1757500000003,2065.3908845706887,480.99363599604379,2546.3845205667326,2000.7992476892791,502.55864236957109,2503.35789005885,-64.591636881409613,-3.1273323303562271E-2]
[null,"-10.01-15%","G",19,{"$f":"E40","v":419100},{"$f":"((E47-(E47*12.5%)))","v":366712.5},0,419100,4235.875,362476.625,-0.13510707468384633,4191,0,4191,3624.7662500000001,0,3624.7662500000001,2065.3908845706887,480.99363599604379,2546.3845205667326,1882.1953776828086,475.39331034959429,2357.5886880324028,-183.19550688788013,-8.8697741554117041E-2]
[null,"-15.01+","H",7,{"$f":"E40","v":419100},{"$f":"((E48-(E48*15%)))","v":356235},0,419100,5178.8500000000022,351056.15,-0.16235707468384628,4191,0,4191,3510.5615000000003,0,3510.5615000000003,2065.3908845706887,480.99363599604379,2546.3845205667326,1822.8934426795734,461.81064433960591,2284.7040870191795,-242.49744189111539,-0.11740995067939443]
[]
["Prior Lake","+15.01+%","A",1988,307300,{"$f":"E50*1.15","v":353395},{"$f":"IF(E50<413800,(30400-((E50-76000)*9%)),0)","v":9583},{"$f":"E50-G50","v":297717},{"$f":"IF(F50<413800,(30400-((F50-76000)*9%)),0)","v":5434.4500000000007},{"$f":"F50-I50","v":347960.55},{"$f":"((J50-H50)/H50)","v":0.16876278479226914},{"$f":"IF(H50>500000,(500000*L$29),(H50*L$29))","v":2977.17},{"$f":"IF(E50<500000,0,(E50-500000)*M$29)","v":0},{"$f":"SUM(L50:M50)","v":2977.17},{"$f":"IF(J50>500000,(500000*O$29),(J50*O$29))","v":3479.6055000000001},{"$f":"IF(J50<500000,0,(J50-500000)*P$29)","v":0},{"$f":"SUM(O50:P50)","v":3479.6055000000001},{"$f":"N50*$E$10","v":1467.1963206435976},352.68275910661953,1819.879079750217,{"$f":"Q50*$E$21","v":1806.8192364844706},458.12896727271328,2264.9482037571838,{"$f":"U50-R50","v":339.62291584087302},{"$f":"X50/R50","v":0.23147748604760315},266900,285400,338100,{"$f":"((AA50-Z50)/Z50)","v":6.9314349943799175E-2}]
[{"$f":"SUM(D50:D58)","v":8918},"+10.01-15.00%","B",819,{"$f":"E50","v":307300},{"$f":"E51*1.125","v":345712.5},9583,297717,6125.875,339586.625,0.14063565399355765,2977.17,0,2977.17,3395.86625,0,3395.86625,1467.1963206435976,352.68275910661953,1819.879079750217,1763.3368107471902,448.16964189721955,2211.5064526444098,296.14049010359258,0.20184108011781829]
[null,"+5.01-10.00%","C",2148,{"$f":"E51","v":307300},{"$f":"E52*1.075","v":330347.5},9583,297717,7508.7250000000022,322838.77500000002,8.4381392396134666E-2,2977.17,0,2977.17,3228.3877500000003,0,3228.3877500000003,1467.1963206435976,352.68275910661953,1819.879079750217,1676.3719592726297,428.25099114623202,2104.6229504188618,209.17563862903216,0.14256826825824889]
[null,"+0.01-5.00%","D",3621,307300,{"$f":"E53*1.02","v":313446},9583,297717,9029.86,304416.14,2.2501704638969271E-2,2977.17,0,2977.17,3044.1614000000004,0,3044.1614000000004,1467.1963206435976,352.68275910661953,1819.879079750217,1580.710622650613,406.34047532014569,1987.0510979707587,113.51430200701543,7.7368175212722365E-2]
[null,"No Change","E",2,307300,{"$f":"E54","v":307300},9583,297717,9583,297717,0,2977.17,0,2977.17,2977.17,0,2977.17,1467.1963206435976,352.68275910661953,1819.879079750217,1545.9246820607887,398.37301501975071,1944.2976970805394,78.728361417191081,5.3659050468894472E-2]
[null,"-0.01-5.00%","F",162,307300,{"$f":"((E55-(E55*2.5%)))","v":299617.5},9583,297717,10274.424999999999,289343.07500000001,-2.8127130798711489E-2,2977.17,0,2977.17,2893.43075,0,2893.43075,1467.1963206435976,352.68275910661953,1819.879079750217,1502.4422563235082,388.41368964425692,1890.8559459677651,35.245935679910644,2.4022644539109617E-2]
[null,"-5.01-10%","F",125,307300,{"$f":"((E56-(E56*7.5%)))","v":284252.5},9583,297717,11657.275000000001,272595.22499999998,-8.4381392396134666E-2,2977.17,0,2977.17,2725.9522499999998,0,2725.9522499999998,1467.1963206435976,352.68275910661953,1819.879079750217,1415.4774048489476,368.4950388932694,1783.9724437422169,-51.718915794650002,-3.5250167320459935E-2]
[null,"-10.01-15%","G",49,307300,{"$f":"((E57-(E57*12.5%)))","v":268887.5},9583,297717,13040.125,255847.375,-0.14063565399355765,2977.17,0,2977.17,2558.4737500000001,0,2558.4737500000001,1467.1963206435976,352.68275910661953,1819.879079750217,1328.5125533743869,348.57638814228187,1677.0889415166689,-138.68376726921065,-9.4522979180029498E-2]
[null,"-15.01+","G",4,307300,{"$f":"((E58-(E58*15%)))","v":261205},9583,297717,13731.55,247473.45,-0.16876278479226914,2977.17,0,2977.17,2474.7345,0,2474.7345,1467.1963206435976,352.68275910661953,1819.879079750217,1285.0301276371065,338.61706276678808,1623.6471904038945,-182.16619300649108,-0.12415938510981435]
[]
["Sand Creek","+15.01+%","A",13,327200,{"$f":"E60*1.15","v":376280},{"$f":"IF(E60<413800,(30400-((E60-76000)*9%)),0)","v":7792},{"$f":"E60-G60","v":319408},{"$f":"IF(F60<413800,(30400-((F60-76000)*9%)),0)","v":3374.7999999999993},{"$f":"F60-I60","v":372905.2},{"$f":"((J60-H60)/H60)","v":0.16748860391724693},{"$f":"IF(H60>500000,(500000*L$29),(H60*L$29))","v":3194.08},{"$f":"IF(E60<500000,0,(E60-500000)*M$29)","v":0},{"$f":"SUM(L60:M60)","v":3194.08},{"$f":"IF(J60>500000,(500000*O$29),(J60*O$29))","v":3729.0520000000001},{"$f":"IF(J60<500000,0,(J60-500000)*P$29)","v":0},{"$f":"SUM(O60:P60)","v":3729.0520000000001},{"$f":"N60*$E$10","v":1574.092988926162},375.52163612003227,1949.6146250461943,{"$f":"Q60*$E$21","v":1936.3467747855004},487.79628405997983,2424.1430588454805,362.25378585933845,0.23013493383670178,302500,327400,354200,{"$f":"((AA60-Z60)/Z60)","v":8.2314049586776863E-2}]
[{"$f":"SUM(D60:D68)","v":386},"+10.01-15.00%","B",56,{"$f":"E60","v":327200},{"$f":"E61*1.125","v":368100},7792,319408,4111,363989,0.13957383659770575,3194.08,0,3194.08,3639.89,0,3639.89,1574.092988926162,375.52163612003227,1949.6146250461943,1890.0485329981975,477.19201701519762,2367.240550013395,315.95554407203554,0.20072228660873381]
[null,"+5.01-10.00%","C",151,{"$f":"E61","v":327200},{"$f":"E62*1.075","v":351740},7792,319408,5583.4000000000015,346156.6,8.3744301958623382E-2,3194.08,0,3194.08,3461.5659999999998,0,3461.5659999999998,1574.092988926162,375.52163612003227,1949.6146250461943,1797.4520494235919,455.98348292563327,2253.435532349225,223.35906049742994,0.141896992152798]
[null,"+0.01-5.00%","D",154,327200,{"$f":"E63*1.02","v":333744},7792,319408,7203.0400000000009,326540.96000000002,2.2331813855632987E-2,3194.08,0,3194.08,3265.4096000000004,0,3265.4096000000004,1574.092988926162,375.52163612003227,1949.6146250461943,1695.5959174915263,432.65409542711251,2128.2500129186387,121.5029285653643,7.7189168251268925E-2]
[null,"No Change","E",3,327200,{"$f":"E64","v":327200},7792,319408,7792,319408,0,3194.08,0,3194.08,3194.08,0,3194.08,1574.092988926162,375.52163612003227,1949.6146250461943,1658.5573240616839,424.17068179128677,2082.7280058529705,84.464335135521878,5.3659050468894479E-2]
[null,"-0.01-5.00%","F",5,327200,{"$f":"((E65-(E65*2.5%)))","v":319020},7792,319408,8528.2000000000007,310491.8,-2.7914767319541189E-2,3194.08,0,3194.08,3104.9180000000001,0,3104.9180000000001,1574.092988926162,375.52163612003227,1949.6146250461943,1612.2590822743814,413.56641474650462,2025.8254970208859,38.16609334821942,2.4246403240926782E-2]
[null,"-5.01-10%","G",4,327200,{"$f":"((E66-(E66*7.5%)))","v":302660},7792,319408,10000.600000000002,292659.40000000002,-8.3744301958623382E-2,3194.08,0,3194.08,2926.5940000000005,0,2926.5940000000005,1574.092988926162,375.52163612003227,1949.6146250461943,1519.662598699776,392.35788065694027,1912.0204793567164,-54.430390226385953,-3.4578891215008893E-2]
[null,"-10.01-15%","G",0,327200,{"$f":"((E67-(E67*12.5%)))","v":286300},7792,319408,11473,274827,-0.13957383659770575,3194.08,0,3194.08,2748.27,0,2748.27,1574.092988926162,375.52163612003227,1949.6146250461943,1427.0661151251704,371.14934656737591,1798.2154616925463,-147.02687380099155,-9.3404185670944717E-2]
[null,"-15.01+","H",0,327200,{"$f":"((E68-(E68*15%)))","v":278120},7792,319408,12209.2,265910.8,-0.16748860391724693,3194.08,0,3194.08,2659.1079999999997,0,2659.1079999999997,1574.092988926162,375.52163612003227,1949.6146250461943,1380.7678733378675,360.54507952259377,1741.3129528604613,-193.32511558829447,-0.1228168328989127]
[]
["Savage","+15.01+%","A",149,265400,{"$f":"E70*1.15","v":305210},13354,252046,{"$f":"IF(F70<413800,(30400-((F70-76000)*9%)),0)","v":9771.1000000000022},295438.90000000002,0.17216262110884531,2520.46,0,2520.46,2954.3890000000001,0,2954.3890000000001,1242.1224311441274,304.594872329635,1546.7173034737625,{"$f":"Q70*$E$21","v":1534.0954246848153},395.66361182615719,1929.7590365109725,291.97299354068787,0.23505975435267645,248800,255400,274200,{"$f":"((AA70-Z70)/Z70)","v":2.652733118971061E-2}]
[{"$f":"SUM(D70:D78)","v":9356},"+10.01-15.00%","B",170,{"$f":"E70","v":265400},{"$f":"E71*1.125","v":298575},13354,252046,10368.25,288206.75,0.14346885092403769,2520.46,0,2520.46,2882.0675000000001,0,2882.0675000000001,1242.1224311441274,304.594872329635,1546.7173034737625,1496.5417774649186,387.06222896037116,1883.6040064252898,254.41934632079119,0.20482630370537935]
[null,"+5.01-10.00%","C",2244,{"$f":"E71","v":265400},{"$f":"E72*1.075","v":285305},13354,252046,11562.55,273742.45,8.6081310554422655E-2,2520.46,0,2520.46,2737.4245000000001,0,2737.4245000000001,1242.1224311441274,304.594872329635,1546.7173034737625,1421.4344830251257,369.85946322879914,1791.2939462539248,179.3120518809983,0.14435940241078551]
[null,"+0.01-5.00%","D",4873,265400,{"$f":"E73*1.02","v":270708},13354,252046,12876.279999999999,257831.72,2.2955016147846032E-2,2520.46,0,2520.46,2578.3172,0,2578.3172,1242.1224311441274,304.594872329635,1546.7173034737625,1338.8164591413533,350.93642092406986,1689.7528800654231,96.69402799722593,7.7845810986732128E-2]
[null,"No Change","E",13,265400,{"$f":"E74","v":265400},13354,252046,13354,252046,0,2520.46,0,2520.46,2520.46,0,2520.46,1242.1224311441274,304.594872329635,1546.7173034737625,1308.7735413654361,344.05531463144104,1652.8288559968771,66.651110221308727,5.3659050468894548E-2]
[null,"-0.01-5.00%","F",1753,265400,{"$f":"((E75-(E75*2.5%)))","v":258765},13354,252046,13951.150000000001,244813.85,-2.8693770184807513E-2,2520.46,0,2520.46,2448.1385,0,2448.1385,1242.1224311441274,304.594872329635,1546.7173034737625,1271.2198941455395,335.453931765655,1606.6738259111944,29.097463001412052,2.3425599821597441E-2]
[null,"-5.01-10%","F",145,265400,{"$f":"((E76-(E76*7.5%)))","v":245495},13354,252046,15145.45,230349.55,-8.6081310554422655E-2,2520.46,0,2520.46,2303.4955,0,2303.4955,1242.1224311441274,304.594872329635,1546.7173034737625,1196.1125997057466,318.25116603408298,1514.3637657398294,-46.009831438380843,-3.7041301472996405E-2]
[null,"-10.01-15%","G",4,265400,{"$f":"((E77-(E77*12.5%)))","v":232225},13354,252046,16339.75,215885.25,-0.14346885092403769,2520.46,0,2520.46,2158.8525,0,2158.8525,1242.1224311441274,304.594872329635,1546.7173034737625,1121.0053052659534,301.04840030251091,1422.0537055684645,-121.11712587817397,-9.7508202767590438E-2]
[null,"-15.01+","H",5,265400,{"$f":"((E78-(E78*15%)))","v":225590},13354,252046,16936.900000000001,208653.1,-0.1721626211088452,2520.46,0,2520.46,2086.5309999999999,0,2086.5309999999999,1242.1224311441274,304.594872329635,1546.7173034737625,1083.451658046057,292.44701743672488,1375.898675482782,-158.67077309807041,-0.12774165341488736]
[]
["Shakopee","+15.01+%","A",149,229100,{"$f":"E80*1.15","v":263465},16621,212479,{"$f":"IF(F80<413800,(30400-((F80-76000)*9%)),0)","v":13528.150000000001},249936.85,0.17628965686020739,2124.79,0,2124.79,2499.3685,0,2499.3685,1047.1300161362333,262.93400621974143,1310.0640223559747,{"$f":"Q80*$E$21","v":1297.8215734120827},341.54684803832936,1639.3684214504119,250.69155727584939,0.2394082429237078,207700,220200,242100,{"$f":"((AA80-Z80)/Z80)","v":6.0182956186807898E-2}]
[{"$f":"SUM(D80:D88)","v":11990},"+10.01-15.00%","B",646,{"$f":"E80","v":229100},{"$f":"E81*1.125","v":257737.5},16621,212479,14043.625,243693.875,0.14690804738350613,2124.79,0,2124.79,2436.9387500000003,0,2436.9387500000003,1047.1300161362333,262.93400621974143,1310.0640223559747,1265.4043142633327,334.12191655923527,1599.5262308225679,218.27429812709943,0.20845004418123908]
[null,"+5.01-10.00%","C",7067,{"$f":"E81","v":229100},{"$f":"E82*1.075","v":246282.5},16621,212479,15074.575000000001,231207.92499999999,8.8144828430103628E-2,2124.79,0,2124.79,2312.0792499999998,0,2312.0792499999998,1047.1300161362333,262.93400621974143,1310.0640223559747,1200.5697959658321,319.27205360104705,1519.8418495668791,153.43977982959882,0.14653364669630103]
[null,"+0.01-5.00%","D",2661,229100,{"$f":"E83*1.02","v":233682},16621,212479,16208.62,217473.38,2.3505287581361004E-2,2124.79,0,2124.79,2174.7338,0,2174.7338,1047.1300161362333,262.93400621974143,1310.0640223559747,1129.2518258385817,302.93720434703999,1432.1890301856217,82.121809702348401,7.8425609462869431E-2]
[null,"No Change","E",29,229100,{"$f":"E84","v":229100},16621,212479,16621,212479,0,2124.79,0,2124.79,2124.79,0,2124.79,1047.1300161362333,262.93400621974143,1310.0640223559747,1103.3180185195818,296.99725916376468,1400.3152776833465,56.188002383348476,5.365905046889452E-2]
[null,"-0.01-5.00%","F",1414,229100,{"$f":"((E85-(E85*2.5%)))","v":223372.5},16621,212479,17136.474999999999,206236.02499999999,-2.9381609476701254E-2,2124.79,0,2124.79,2062.3602500000002,0,2062.3602500000002,1047.1300161362333,262.93400621974143,1310.0640223559747,1070.9007593708316,289.57232768467054,1360.4730870555022,23.770743234598285,2.2700851726425608E-2]
[null,"-5.01-10%","G",14,229100,{"$f":"((E86-(E86*7.5%)))","v":211917.5},16621,212479,18167.425000000003,193750.07500000001,-8.8144828430103628E-2,2124.79,0,2124.79,1937.5007500000002,0,1937.5007500000002,1047.1300161362333,262.93400621974143,1310.0640223559747,1006.0662410733313,274.72246472648231,1280.7887057998137,-41.063775062901982,-3.9215545758512112E-2]
[null,"-10.01-15%","G",6,229100,{"$f":"((E87-(E87*12.5%)))","v":200462.5},16621,212479,19198.375,181264.125,-0.14690804738350613,2124.79,0,2124.79,1812.6412500000001,0,1812.6412500000001,1047.1300161362333,262.93400621974143,1310.0640223559747,941.23172277583092,259.87260176829409,1201.1043245441251,-105.89829336040236,-0.10113194324344994]
[null,"-15.01+","H",4,229100,{"$f":"((E88-(E88*15%)))","v":194735},16621,212479,19713.849999999999,175021.15,-0.17628965686020739,2124.79,0,2124.79,1750.2114999999999,0,1750.2114999999999,1047.1300161362333,262.93400621974143,1310.0640223559747,908.81446362708061,252.44767028919998,1161.2621339162806,-138.31555250915267,-0.13209014198591895]
[null,null,null,{"$f":"SUM(D80:D88)","v":11990}]
[null,null,null,{"$f":"D82/D89","v":0.58940783986655543}]
[null,null,null,{"$f":"D83/D89","v":0.22193494578815678}]
[null,null,null,{"$f":"SUM(D90:D91)","v":0.81134278565471218}]

{"sheet":"Tax Calculator","index":7,"n_rows":81,"n_cols":52,"rows_kept":81,"cut":false,"hidden":false,"merged":[[2,0,2,10],[8,0,8,14],[12,19,12,22]]}
[{"$f":"'Specific LLC Information'!A1","v":"Independent School District 720 - Shakopee Public School District"}]
[{"$f":"'Specific LLC Information'!A3","v":"LLC Updated 10-02-17 Worksheet Update 10-30-17"}]
[]
[]
[]
[null,null,null,null,null,null,null,null,null,"RMV Tax Base Appreciation",null,{"$f":"'720'!S15","v":6.2605217640157126E-2}]
[null,null,null,null,null,null,null,null,null,"NTC Tax Base Appreciation",null,{"$f":"'720'!S18","v":4.4045509890118469E-2}]
[null,null,null,null,null,null,null,null,null,"Enter in Property Valuation Appreciation",null,2.75E-2]
["Est. Change in the School Portion of Property Taxes from Pay 2017 to Pay 2018"]
[null,null,null,null,null,"RMV Pay 2017",null,"NTC Pay 2017",null,"Est RMV Pay 2018",null,"Est NTC Pay 2018",null,"Difference"]
[null,null,"Categorical RMV Levy Items"]
[null,null,"General RMV - Voter-Approved-JOBZ Exempt",null,null,{"$f":"'Specific LLC Information'!C15","v":0},null,null,null,{"$f":"'Specific LLC Information'!F15","v":0},null,null,null,{"$f":"J12-F12","v":0}]
[null,null,"General RMV - Other-JOBZ Exempt",null,null,{"$f":"'Specific LLC Information'!C23","v":5991216.5600000005},null,null,null,{"$f":"'Specific LLC Information'!F23","v":7009394.3800000008},null,null,null,1018177.8200000003]
[null,null,"Input Desired Adjustment",null,null,0,null,null,null,0,null,null,null,0]
[null,null,"Initial RMV Levy",null,null,{"$f":"SUM(F12:F14)","v":5991216.5600000005},null,null,null,{"$f":"SUM(J12:J14)","v":7009394.3800000008},null,null,null,1018177.8200000003]
[null,null,"Less: Fiscal Disparity Offsets",null,null,{"$f":"District!E45","v":-703983},null,null,null,-663305,null,null,null,40678]
[null,null,"Final RMV Levy",null,null,{"$f":"F15+F16","v":5287233.5600000005},null,null,null,{"$f":"J15+J16","v":6346089.3800000008},null,null,null,1058855.8200000003]
[]
[null,null,"RMV",null,null,{"$f":"District!K19","v":4606879600},null,null,null,{"$f":"F19*(1+$L$6)","v":4895294300}]
[]
[null,null,"RMV Tax Rate",null,null,{"$f":"ROUND(F17/F19,7)","v":1.1477E-3},null,null,null,{"$f":"ROUND(J17/J19,7)","v":1.2964000000000001E-3}]
[]
[null,null,"Categorical NTC Levy Items"]
[null,null,"Gen NTC VA - JOBZ Exempt",null,null,null,null,{"$f":"'Specific LLC Information'!C30","v":3011717.06},null,null,null,{"$f":"'Specific LLC Information'!F30","v":3206596.1},null,{"$f":"L24-H24","v":194879.04000000004}]
[null,null,"Gen NTC Other Gen Ed - JOBZ Exempt",null,null,null,null,{"$f":"'Specific LLC Information'!C35","v":74895.22},null,null,null,{"$f":"'Specific LLC Information'!F35","v":0},null,{"$f":"L25-H25","v":-74895.22}]
[null,null,"General NTC Other JOBZ Exempt",null,null,null,null,{"$f":"'Specific LLC Information'!C68","v":4644539.8400000008},null,null,null,{"$f":"'Specific LLC Information'!F68","v":5423209.4400000004},null,{"$f":"L26-H26","v":778669.59999999963}]
[null,null,"Community Service JOBZ Exempt",null,null,null,null,{"$f":"'Specific LLC Information'!C77","v":586043.17999999993},null,null,null,{"$f":"'Specific LLC Information'!F77","v":590824.18000000017},null,{"$f":"L27-H27","v":4781.0000000002328}]
[null,null,"Debt Service Voter-Approved JOBZ Non-Exempt",null,null,null,null,{"$f":"'Specific LLC Information'!C84","v":19004666.869999997},null,null,null,{"$f":"'Specific LLC Information'!F84","v":20341203.43},null,{"$f":"L28-H28","v":1336536.5600000024}]
[null,null,"Debt Service Other JOBZ Non-Exempt",null,null,null,null,{"$f":"'Specific LLC Information'!C94","v":0},null,null,null,{"$f":"'Specific LLC Information'!F94","v":0},null,0]
[null,null,"OPEB / Pension Debt Service VA JOBZ Non-Exempt",null,null,null,null,{"$f":"'Specific LLC Information'!C101","v":0},null,null,null,{"$f":"'Specific LLC Information'!F101","v":0},null,0]
[null,null,"OPEB / Pension Debt Service Other JOBZ Non-Exempt",null,null,null,null,{"$f":"'Specific LLC Information'!C108","v":0},null,null,null,{"$f":"'Specific LLC Information'!F108","v":0},null,0]
[null,null,"Input Desired Adjustment",null,null,null,null,0,null,null,null,0,null,0]
[null,null,"Initial NTC Subtotal",null,null,null,null,{"$f":"SUM(H24:H32)","v":27321862.169999998},null,null,null,{"$f":"SUM(L24:L32)","v":29561833.149999999},null,2239970.9800000004]
[null,null,"Less: Fiscal Disparity Offsets",null,null,null,null,{"$f":"District!E55","v":-3200015},null,null,null,-3026162,null,173853]
[null,null,"Final NTC Levy",null,null,null,null,{"$f":"H33+H34","v":24121847.169999998},null,null,null,{"$f":"L33+L34","v":26535671.149999999},null,2413823.9800000004]
[]
[null,null,"NTC - JOBZ Exempt Less Fiscal Disparities",null,null,null,null,{"$f":"SUM(H24:H27)+((SUM(H24:H27)/H33)*H34)","v":7343061.4890493872},null,null,null,{"$f":"SUM(L24:L27)+((SUM(L24:L27)/L33)*L34)","v":8276739.7002860289},null,933678.21123664174]
[null,null,"NTC - JOBZ Non-Exempt Less Fiscal Disparities Ag2School",null,null,null,null,{"$f":"SUM(H28:H29)+((SUM(H28:H29)/H33)*H34)","v":16778785.680950612},null,null,null,{"$f":"SUM(L28:L29)+((SUM(L28:L29)/L33)*L34)","v":18258931.449713971},null,{"$f":"L38-H38","v":1480145.7687633596}]
[null,null,"NTC - JOBZ Non-Exempt Less Fiscal Disparities Non Ag2School",null,null,null,null,{"$f":"SUM(H30:H31)+((SUM(H30:H31)/H33)*H34)","v":0},null,null,null,{"$f":"SUM(L30:L31)+((SUM(L30:L31)/L33)*L34)","v":0},null,0]
[null,null,"Final NTC Levy",null,null,null,null,{"$f":"SUM(H37:H39)","v":24121847.169999998},null,null,null,{"$f":"SUM(L37:L39)","v":26535671.149999999},null,2413823.9800000004]
[]
[null,null,"NTC Excluding JOBZ",null,null,null,null,{"$f":"District!H19","v":48946987},null,null,null,{"$f":"H42*(1+L7)","v":51102882},null,2155895,null,null,null,null,null,null,null,null,null,null,null,null,null,null,null,null,null,null,null,null,null,null,null,null,null,null,90090.090909000006]
[null,null,"NTC JOBZ",null,null,null,null,{"$f":"District!J32","v":0},null,null,null,{"$f":"H43","v":0},null,0,null,null,null,null,null,null,null,null,null,null,null,null,null,null,null,null,null,null,null,null,null,null,null,null,null,null,0.11]
[null,null,"Total NTC with JOBZ",null,null,null,null,{"$f":"H42+H43","v":48946987},null,null,null,{"$f":"L42+L43","v":51102882},null,2155895,null,null,null,null,null,null,null,null,null,null,null,null,null,null,null,null,null,null,null,null,null,null,null,null,null,null,{"$f":"AO42*(1+AO43)","v":100000.00090899001},null,{"$f":"AO44/AO42","v":1.1100000000000001}]
[]
[null,null,"Total NTC Tax Rate",null,null,null,null,{"$f":"ROUND((H37/H42)+(H38/H44)+(H39/H44),5)","v":0.49281999999999998},null,null,null,{"$f":"ROUND((L37/L42)+(L38/L44)+(L39/L44),5)","v":0.51926000000000005}]
[null,null,"Ag2School NTC Tax Rate",null,null,null,null,"NA",null,null,null,{"$f":"ROUND((L38/L44),5)","v":0.35730000000000001}]
[]
[null,null,"Total Tax Rates",null,null,{"$f":"F21","v":1.1477E-3},null,{"$f":"H46","v":0.49281999999999998},null,{"$f":"J21","v":1.2964000000000001E-3},null,{"$f":"L46","v":0.51926000000000005},null,null,null,null,null,null,null,null,null,null,null,null,null,null,null,null,null,null,null,null,null,null,null,null,null,null,null,null,{"$f":"L8","v":2.75E-2},"Enter Tax Base Appreciation (do not include new construction)"]
[null,null,null,null,null,null,null,null,null,null,null,null,null,null,null,null,null,null,null,"MV Exclusion Data",null,null,null,null,null,null,null,null,null,null,null,null,null,null,null,null,null,null,null,null,"MV Exclusion Data"]
["Types of Property",null,"Pay 2018 Est. Value","Pay 2017 Est. Value",null,{"$f":"F10","v":"RMV Pay 2017"},null,{"$f":"H10","v":"NTC Pay 2017"},null,{"$f":"J10","v":"Est RMV Pay 2018"},null,{"$f":"L10","v":"Est NTC Pay 2018"},null,{"$f":"N10","v":"Difference"},null,null,"NTC of Properties to the left",null,null,"EMV and RMV",null,null,null,null,null,null,null,null,null,null,null,null,null,null,null,null,null,"Pay 2016 NTC of Properties to the left",null,null,"EMV and RMV"]
["Residential Homestead",null,{"$f":"D52*(1+$L$8)","v":102750.00000000001},100000,null,{"$f":"$AO52*F$21","v":114.77},null,{"$f":"$AL52*H$49","v":353.84476000000001},null,{"$f":"$T52*J$21","v":133.20510000000002},null,{"$f":"$Q52*L$49","v":388.40648000000004},null,{"$f":"(J52+L52)-(F52+H52)","v":52.996820000000014},null,null,{"$f":"ROUND((0.01*MIN(500000,C52)+0.0125*MAX(C52-500000,0))-AC52,0)","v":748},null,null,{"$f":"C52","v":102750.00000000001},null,null,0.4,{"$f":"MIN(T52*W52,30400)","v":30400},{"$f":"IF(T52>76000,T52-76000,0)","v":26750.000000000015},0.09,{"$f":"Y52*Z52","v":2407.5000000000014},{"$f":"MAX(X52-AA52,0)","v":27992.5},{"$f":"ROUND((0.01*MIN(500000,AB52)+0.0125*MAX(AB52-500000,0)),0)","v":280},null,null,null,null,null,null,null,null,{"$f":"ROUND((0.01*MIN(500000,D52)+0.0125*MAX(D52-500000,0))-AV52,0)","v":718},null,null,{"$f":"D52","v":100000},0.4,{"$f":"MIN(AO52*AP52,30400)","v":30400},{"$f":"IF(AO52>76000,AO52-76000,0)","v":24000},0.09,{"$f":"AR52*AS52","v":2160},{"$f":"MAX(AQ52-AT52,0)","v":28240},{"$f":"ROUND((0.01*MIN(500000,AU52)+0.0125*MAX(AU52-500000,0)),0)","v":282}]
[null,null,{"$f":"D53*(1+$L$8)","v":128437.50000000001},125000,null,{"$f":"$AO53*F$21","v":143.46250000000001},null,487.89179999999999,null,{"$f":"$T53*J$21","v":166.50637500000002},null,{"$f":"$Q53*L$49","v":533.28002000000004},null,{"$f":"(J53+L53)-(F53+H53)","v":68.432095000000118},null,null,1027,null,null,{"$f":"C53","v":128437.50000000001},null,null,0.4,30400,52437.500000000015,0.09,4719.3750000000009,25680.625,{"$f":"ROUND((0.01*MIN(500000,AB53)+0.0125*MAX(AB53-500000,0)),0)","v":257},null,null,null,null,null,null,null,null,990,null,null,{"$f":"D53","v":125000},0.4,30400,49000,0.09,4410,25990,{"$f":"ROUND((0.01*MIN(500000,AU53)+0.0125*MAX(AU53-500000,0)),0)","v":260}]
[null,null,154125,150000,null,172.155,null,622.43165999999997,null,199.80765000000002,null,{"$f":"$Q54*L$49","v":678.67282000000012},null,83.893810000000258,null,null,1307,null,null,154125,null,null,0.4,30400,78125,0.09,7031.25,23368.75,234,null,null,null,null,null,null,null,null,1263,null,null,150000,0.4,30400,74000,0.09,6660,23740,237]
[null,null,179812.5,175000,null,200.8475,null,756.4787,null,233.108925,null,824.06562000000008,null,99.848345000000108,null,null,1587,null,null,179812.5,null,null,0.4,30400,103812.5,0.09,9343.125,21056.875,211,null,null,null,null,null,null,null,null,1535,null,null,175000,0.4,30400,99000,0.09,8910,21490,215]
[null,null,205500.00000000003,200000,null,229.54,null,891.01855999999998,null,266.41020000000003,null,969.97768000000008,null,115.82932000000028,null,null,1868,null,null,205500.00000000003,null,null,0.4,30400,129500.00000000003,0.09,11655.000000000002,18745,187,null,null,null,null,null,null,null,null,1808,null,null,200000,0.4,30400,124000,0.09,11160,19240,192]
[null,null,231187.50000000003,225000,null,258.23250000000002,null,1025.0655999999999,null,299.71147500000006,null,{"$f":"$Q57*L$49","v":1115.37048},null,{"$f":"(J57+L57)-(F57+H57)","v":131.78385500000013},null,null,2148,null,null,231187.50000000003,null,null,0.4,30400,155187.50000000003,0.09,13966.875000000002,16433.125,164,null,null,null,null,null,null,null,null,2080,null,null,225000,0.4,30400,149000,0.09,13410,16990,170]
[null,null,256875.00000000003,250000,null,286.92500000000001,null,1159.60546,null,333.01275000000004,null,1260.7632800000001,null,147.24557000000027,null,null,2428,null,null,256875.00000000003,null,null,0.4,30400,180875.00000000003,0.09,16278.750000000002,14121.249999999998,141,null,null,null,null,null,null,null,null,2353,null,null,250000,0.4,30400,174000,0.09,15660,14740,147]
[null,null,282562.5,275000,null,315.61750000000001,null,1293.6524999999999,null,366.31402500000002,null,1406.1560800000002,null,{"$f":"(J59+L59)-(F59+H59)","v":163.20010500000035},null,null,2708,null,null,{"$f":"C59","v":282562.5},null,null,0.4,{"$f":"MIN(T59*W59,30400)","v":30400},{"$f":"IF(T59>76000,T59-76000,0)","v":206562.5},0.09,{"$f":"Y59*Z59","v":18590.625},{"$f":"MAX(X59-AA59,0)","v":11809.375},{"$f":"ROUND((0.01*MIN(500000,AB59)+0.0125*MAX(AB59-500000,0)),0)","v":118},null,null,null,null,null,null,null,null,2625,null,null,275000,0.4,30400,199000,0.09,17910,12490,125]
[null,null,308250,300000,null,344.31,null,1428.19236,null,399.61530000000005,null,1551.5488800000001,null,{"$f":"(J60+L60)-(F60+H60)","v":178.66182000000026},null,null,2988,null,null,{"$f":"C60","v":308250},null,null,0.4,{"$f":"MIN(T60*W60,30400)","v":30400},{"$f":"IF(T60>76000,T60-76000,0)","v":232250},0.09,{"$f":"Y60*Z60","v":20902.5},{"$f":"MAX(X60-AA60,0)","v":9497.5},{"$f":"ROUND((0.01*MIN(500000,AB60)+0.0125*MAX(AB60-500000,0)),0)","v":95},null,null,null,null,null,null,null,null,2898,null,null,300000,0.4,30400,224000,0.09,20160,10240,102]
[null,null,333937.5,325000,null,373.0025,null,1562.2393999999999,null,432.91657500000002,null,1696.4224200000001,null,{"$f":"(J61+L61)-(F61+H61)","v":194.09709500000008},null,null,3267,null,null,{"$f":"C61","v":333937.5},null,null,0.4,{"$f":"MIN(T61*W61,30400)","v":30400},{"$f":"IF(T61>76000,T61-76000,0)","v":257937.5},0.09,{"$f":"Y61*Z61","v":23214.375},{"$f":"MAX(X61-AA61,0)","v":7185.625},{"$f":"ROUND((0.01*MIN(500000,AB61)+0.0125*MAX(AB61-500000,0)),0)","v":72},null,null,null,null,null,null,null,null,3170,null,null,325000,0.4,30400,249000,0.09,22410,7990,80]
[null,null,359625,350000,null,401.69499999999999,null,1696.77926,null,466.21785,null,1841.8152200000002,null,209.55881000000045,null,null,3547,null,null,359625,null,null,0.4,30400,283625,0.09,25526.25,4873.75,49,null,null,null,null,null,null,null,null,3443,null,null,350000,0.4,30400,274000,0.09,24660,5740,57]
[null,null,513750.00000000006,500000,null,573.85,null,2464.1,null,666.02550000000008,null,2685.6127200000001,null,{"$f":"(J63+L63)-(F63+H63)","v":313.68822000000046},null,null,5172,null,null,{"$f":"C63","v":513750.00000000006},null,null,0.4,{"$f":"MIN(T63*W63,30400)","v":30400},{"$f":"IF(T63>76000,T63-76000,0)","v":437750.00000000006},0.09,{"$f":"Y63*Z63","v":39397.500000000007},{"$f":"MAX(X63-AA63,0)","v":0},{"$f":"ROUND((0.01*MIN(500000,AB63)+0.0125*MAX(AB63-500000,0)),0)","v":0},null,null,null,null,null,null,null,null,5000,null,null,500000,0.4,30400,424000,0.09,38160,0,0]
[null,null,1027500.0000000001,1000000,null,1147.7,null,5544.2249999999995,null,1332.0510000000002,null,6020.3004400000009,null,660.426440000002,null,null,11594,null,null,1027500.0000000001,null,null,0.4,30400,951500.00000000012,0.09,85635.000000000015,0,0,null,null,null,null,null,null,null,null,11250,null,null,1000000,0.4,30400,924000,0.09,83160,0,0]
["Commercial / Industrial",null,102750.00000000001,100000,null,114.77,null,739.23,null,133.20510000000002,null,800.30947500000025,null,79.514575000000264,null,null,{"$f":"(0.015*MIN(150000,C65)+0.02*MAX(C65-150000,0))","v":1541.2500000000002},null,null,102750.00000000001,null,null,null,null,null,null,null,null,null,null,null,null,null,null,null,null,null,{"$f":"(0.015*MIN(150000,D65)+0.02*MAX(D65-150000,0))","v":1500},null,null,100000]
[null,null,256875.00000000003,250000,null,286.92500000000001,null,2094.4850000000001,null,333.01275000000004,null,2278.2532500000002,null,{"$f":"(J66+L66)-(F66+H66)","v":229.85599999999977},null,null,4387.5,null,null,{"$f":"C66","v":256875.00000000003},null,null,null,null,null,null,null,null,null,null,null,null,null,null,null,null,null,{"$f":"(0.015*MIN(150000,D66)+0.02*MAX(D66-150000,0))","v":4250},null,null,250000]
[null,null,513750.00000000006,500000,null,573.85,null,4558.585,null,666.02550000000008,null,4945.9515000000001,null,{"$f":"(J67+L67)-(F67+H67)","v":479.54199999999946},null,null,9525,null,null,{"$f":"C67","v":513750.00000000006},null,null,null,null,null,null,null,null,null,null,null,null,null,null,null,null,null,9250,null,null,500000]
[null,null,770625.00000000012,750000,null,860.77499999999998,null,7022.6849999999995,null,999.03825000000018,null,7613.6497500000014,null,{"$f":"(J68+L68)-(F68+H68)","v":729.22800000000279},null,null,14662.500000000002,null,null,{"$f":"C68","v":770625.00000000012},null,null,null,null,null,null,null,null,null,null,null,null,null,null,null,null,null,14250,null,null,750000]
[null,null,1027500.0000000001,1000000,null,1147.7,null,9486.7849999999999,null,1332.0510000000002,null,10281.348000000004,null,978.91400000000249,null,null,19800.000000000004,null,null,1027500.0000000001,null,null,null,null,null,null,null,null,null,null,null,null,null,null,null,null,null,19250,null,null,1000000]
[null,null,1284375,1250000,null,1434.625,null,11950.885,null,1665.06375,null,12949.046250000001,null,1228.6000000000004,null,null,24937.5,null,null,1284375,null,null,null,null,null,null,null,null,null,null,null,null,null,null,null,null,null,24250,null,null,1250000]
[null,null,1541250.0000000002,1500000,null,1721.55,null,14414.984999999999,null,1998.0765000000004,null,15616.744500000004,null,1478.2860000000055,null,null,30075.000000000004,null,null,1541250.0000000002,null,null,null,null,null,null,null,null,null,null,null,null,null,null,null,null,null,29250,null,null,1500000,null,null,null,null,null,null,null,null,null,"# of acres","MV"]
[null,null,null,null,null,null,null,null,null,null,null,null,null,null,null,null,null,"Home & Garage","$ per Acre","Dwelling Value","NTC of Dwelling","NTC of Ag. Land",null,null,null,null,null,null,null,null,null,"# of acres",null,null,null,null,null,null,"Home & Garage","$ per Acre","Dwelling Value"]
["Agricultural Homestead",{"$f":"CONCATENATE(TEXT(AF73,\"0\"),\" acres\")","v":"40 acres"},665000,{"$f":"AZ73","v":647201.94647201942},null,307.17031630170311,null,{"$f":"$AL73*H$49","v":2189.2095604866176},null,{"$f":"$T73*J$49","v":356.51},null,{"$f":"((L$46-L$47)*$Q73)+((L$47*$V73)*0.6)+(L$47*$U73)","v":2096.9205000000002},null,-42.949376788320478,null,null,{"$f":"0.01*MIN(500000,$T73)+0.0125*MAX($T73-500000,0)+0.01*MAX($C73-$T73-1940000,0)+0.005*MIN(1940000,$C73-$T73)-AD73","v":4575},{"$f":"275000-10000","v":265000},10000,{"$f":"R73+S73","v":275000},{"$f":"ROUND((0.01*MIN(500000,T73)+0.0125*MAX(T73-500000,0))-AD73,0)","v":2625},{"$f":"Q73-U73","v":1950},{"$f":"T73","v":275000},0.4,{"$f":"MIN(W73*X73,30400)","v":30400},{"$f":"IF(W73>76000,W73-76000,0)","v":199000},0.09,{"$f":"Z73*AA73","v":17910},{"$f":"MAX(Y73-AB73,0)","v":12490},{"$f":"ROUND((0.01*MIN(500000,AC73)+0.0125*MAX(AC73-500000,0)),0)","v":125},null,40,{"$f":"((AF73-1)*S73)+T73","v":665000},null,null,null,null,{"$f":"0.01*MIN(500000,$AO73)+0.0125*MAX($AO73-500000,0)+0.01*MAX($D73-$AO73-2050000,0)+0.005*MIN(2050000,$D73-$AO73)-AW73","v":4442.2092457420922},{"$f":"(R73/(1+$AO$49))","v":257907.54257907541},{"$f":"(S73/(1+$AO$49))","v":9732.3600973236007},{"$f":"AM73+AN73","v":267639.90267639898},{"$f":"AO73","v":267639.90267639898},0.4,{"$f":"MIN(AP73*AQ73,30400)","v":30400},{"$f":"IF(AP73>76000,AP73-76000,0)","v":191639.90267639898},0.09,{"$f":"AS73*AT73","v":17247.591240875907},{"$f":"MAX(AR73-AU73,0)","v":13152.408759124093},{"$f":"ROUND((0.01*MIN(500000,AV73)+0.0125*MAX(AV73-500000,0)),0)","v":132},null,{"$f":"AF73","v":40},{"$f":"((AY73-1)*AN73)+AO73","v":647201.94647201942}]
[{"$f":"CONCATENATE(\"(assume dwelling value is \",TEXT(T73,\"$0,000\"))","v":"(assume dwelling value is $275,000"},{"$f":"CONCATENATE(TEXT(AF74,\"0\"),\" acres\")","v":"80 acres"},1065000,{"$f":"AZ74","v":1036496.3503649634},null,307.17031630170311,null,3148.469901119221,null,{"$f":"$T74*J$49","v":356.51},null,{"$f":"((L$46-L$47)*$Q74)+((L$47*$V74)*0.6)+(L$47*$U74)","v":2849.6005000000005},null,-249.52971742092359,null,null,{"$f":"0.01*MIN(500000,$T74)+0.0125*MAX($T74-500000,0)+0.01*MAX($C74-$T74-1940000,0)+0.005*MIN(1940000,$C74-$T74)-AD74","v":6575},{"$f":"R73","v":265000},10000,{"$f":"R74+S74","v":275000},{"$f":"ROUND((0.01*MIN(500000,T74)+0.0125*MAX(T74-500000,0))-AD74,0)","v":2625},{"$f":"Q74-U74","v":3950},{"$f":"T74","v":275000},0.4,{"$f":"MIN(W74*X74,30400)","v":30400},{"$f":"IF(W74>76000,W74-76000,0)","v":199000},0.09,{"$f":"Z74*AA74","v":17910},{"$f":"MAX(Y74-AB74,0)","v":12490},{"$f":"ROUND((0.01*MIN(500000,AC74)+0.0125*MAX(AC74-500000,0)),0)","v":125},null,80,{"$f":"((AF74-1)*S74)+T74","v":1065000},null,null,null,null,{"$f":"0.01*MIN(500000,$AO74)+0.0125*MAX($AO74-500000,0)+0.01*MAX($D74-$AO74-2050000,0)+0.005*MIN(2050000,$D74-$AO74)-AW74","v":6388.681265206812},{"$f":"AM73","v":257907.54257907541},9732.3600973236007,{"$f":"AM74+AN74","v":267639.90267639898},{"$f":"AO74","v":267639.90267639898},0.4,{"$f":"MIN(AP74*AQ74,30400)","v":30400},{"$f":"IF(AP74>76000,AP74-76000,0)","v":191639.90267639898},0.09,{"$f":"AS74*AT74","v":17247.591240875907},{"$f":"MAX(AR74-AU74,0)","v":13152.408759124093},{"$f":"ROUND((0.01*MIN(500000,AV74)+0.0125*MAX(AV74-500000,0)),0)","v":132},null,{"$f":"AF74","v":80},{"$f":"((AY74-1)*AN74)+AO74","v":1036496.3503649634}]
[{"$f":"CONCATENATE(\"and acreage assessed at \",TEXT(S73,\"$0,000\"),\")\")","v":"and acreage assessed at $10,000)"},{"$f":"CONCATENATE(TEXT(AF75,\"0\"),\" acres\")","v":"160 acres"},1865000.0000000002,{"$f":"AZ75","v":1815085.1581508517},null,307.17031630170311,null,5066.9905823844283,null,{"$f":"$T75*J$49","v":356.51},null,4354.960500000001,null,-662.69039868612981,null,null,{"$f":"0.01*MIN(500000,$T75)+0.0125*MAX($T75-500000,0)+0.01*MAX($C75-$T75-1940000,0)+0.005*MIN(1940000,$C75-$T75)-AD75","v":10575},265000,10000,{"$f":"R75+S75","v":275000},2625,7950,{"$f":"T75","v":275000},0.4,{"$f":"MIN(W75*X75,30400)","v":30400},{"$f":"IF(W75>76000,W75-76000,0)","v":199000},0.09,{"$f":"Z75*AA75","v":17910},{"$f":"MAX(Y75-AB75,0)","v":12490},125,null,160,{"$f":"((AF75-1)*S75)+T75","v":1865000},null,null,null,null,10281.625304136254,257907.54257907541,9732.3600973236007,{"$f":"AM75+AN75","v":267639.90267639898},{"$f":"AO75","v":267639.90267639898},0.4,{"$f":"MIN(AP75*AQ75,30400)","v":30400},{"$f":"IF(AP75>76000,AP75-76000,0)","v":191639.90267639898},0.09,{"$f":"AS75*AT75","v":17247.591240875907},{"$f":"MAX(AR75-AU75,0)","v":13152.408759124093},132,null,{"$f":"AF75","v":160},{"$f":"((AY75-1)*AN75)+AO75","v":1815085.1581508517}]
[null,{"$f":"CONCATENATE(TEXT(AF76,\"0\"),\" acres\")","v":"320 acres"},3465000,3372262.7737226277,null,307.17031630170311,null,11502.728161459854,null,{"$f":"$T76*J$49","v":356.51},null,9717.8055000000004,null,-1735.5829777615563,null,null,{"$f":"0.01*MIN(500000,$T76)+0.0125*MAX($T76-500000,0)+0.01*MAX($C76-$T76-1940000,0)+0.005*MIN(1940000,$C76-$T76)-AD76","v":24825},265000,10000,{"$f":"R76+S76","v":275000},2625,22200,{"$f":"T76","v":275000},0.4,{"$f":"MIN(W76*X76,30400)","v":30400},{"$f":"IF(W76>76000,W76-76000,0)","v":199000},0.09,{"$f":"Z76*AA76","v":17910},{"$f":"MAX(Y76-AB76,0)","v":12490},125,null,320,{"$f":"((AF76-1)*S76)+T76","v":3465000},null,null,null,null,23340.627737226278,257907.54257907541,9732.3600973236007,{"$f":"AM76+AN76","v":267639.90267639898},{"$f":"AO76","v":267639.90267639898},0.4,{"$f":"MIN(AP76*AQ76,30400)","v":30400},{"$f":"IF(AP76>76000,AP76-76000,0)","v":191639.90267639898},0.09,{"$f":"AS76*AT76","v":17247.591240875907},{"$f":"MAX(AR76-AU76,0)","v":13152.408759124093},132,null,{"$f":"AF76","v":320},{"$f":"((AY76-1)*AN76)+AO76","v":3372262.7737226277}]
["Agricultural Non-Homestead",null,5137.5,5000,null,null,null,24.640999999999998,null,null,null,{"$f":"((L$46-L$47)*$Q77)+((L$47*$Q77)*0.6)","v":19.334467500000002},null,-5.3065324999999959,null,null,{"$f":"C77*0.01","v":51.375},null,null,{"$f":"C77","v":5137.5},null,null,null,null,null,null,null,null,null,null,null,null,null,null,null,null,null,{"$f":"AO77*0.01","v":50},null,null,{"$f":"D77","v":5000}]
["(dollars per acre)",null,6165.0000000000009,6000,null,null,null,29.569199999999999,null,null,null,{"$f":"((L$46-L$47)*$Q78)+((L$47*$Q78)*0.6)","v":23.201361000000006},null,{"$f":"(J78+L78)-(F78+H78)","v":-6.3678389999999929},null,null,{"$f":"C78*0.01","v":61.650000000000013},null,null,{"$f":"C78","v":6165.0000000000009},null,null,null,null,null,null,null,null,null,null,null,null,null,null,null,null,null,{"$f":"AO78*0.01","v":60},null,null,{"$f":"D78","v":6000}]
[null,null,7706.2500000000009,7500,null,null,null,36.961500000000001,null,null,null,{"$f":"((L$46-L$47)*$Q79)+((L$47*$Q79)*0.6)","v":29.001701250000011},null,-7.9597987499999903,null,null,{"$f":"C79*0.01","v":77.062500000000014},null,null,{"$f":"C79","v":7706.2500000000009},null,null,null,null,null,null,null,null,null,null,null,null,null,null,null,null,null,{"$f":"AO79*0.01","v":75},null,null,{"$f":"D79","v":7500}]
[null,null,9247.5,9000,null,null,null,44.3538,null,null,null,34.802041500000009,null,-9.5517584999999912,null,null,{"$f":"C80*0.01","v":92.475000000000009},null,null,{"$f":"C80","v":9247.5},null,null,null,null,null,null,null,null,null,null,null,null,null,null,null,null,null,{"$f":"AO80*0.01","v":90},null,null,{"$f":"D80","v":9000}]
[null,null,10275,10000,null,null,null,49.281999999999996,null,null,null,38.668935000000005,null,-10.613064999999992,null,null,{"$f":"C81*0.01","v":102.75},null,null,{"$f":"C81","v":10275},null,null,null,null,null,null,null,null,null,null,null,null,null,null,null,null,null,{"$f":"AO81*0.01","v":100},null,null,{"$f":"D81","v":10000}]

{"sheet":"RMV History","index":8,"n_rows":12,"n_cols":12,"rows_kept":12,"cut":false,"hidden":false,"merged":[]}
["Updated 09-25-17"]
[{"$f":"'Tax Calculator'!A1","v":"Independent School District 720 - Shakopee Public School District"}]
[]
[null,null,"RMV","% Change"]
[null,"2011 for Pay 2012",3938023100]
[null,"2012 for Pay 2013",3634462300,{"$f":"(C6-C5)/C5","v":-7.7084565603487698E-2}]
[null,"2013 for Pay 2014",3771087200,3.7591502875129565E-2]
[null,"2014 for Pay 2015",4197222200,0.11300056917273088]
[null,"2015 for Pay 2016",4404202500,4.9313638910992129E-2]
[null,"2016 for Pay 2017",{"$f":"District!K19","v":4606879600},4.6019023875491644E-2]
[null,"Est. 2017 for Pay 2018",{"$f":"C10*(1+'Tax Calculator'!$L$6)","v":4895294300},6.2605217640157126E-2,null,null,null,null,{"$f":"'Scott Co Prelim Data'!E235","v":4895229400},null,{"$f":"I11-C10","v":288349800},{"$f":"K11/C10","v":6.2591130013469415E-2}]
[null,"6-year Average",null,{"$f":"AVERAGE(D6:D11)","v":3.857423114516894E-2}]

{"sheet":"NTC History","index":9,"n_rows":12,"n_cols":12,"rows_kept":12,"cut":false,"hidden":false,"merged":[]}
[{"$f":"'RMV History'!A1","v":"Updated 09-25-17"}]
[{"$f":"'Tax Calculator'!A1","v":"Independent School District 720 - Shakopee Public School District"}]
[]
[null,null,"NTC","% Change"]
[null,"2011 for Pay 2012",40240611]
[null,"2012 for Pay 2013",37001721,{"$f":"(C6-C5)/C5","v":-8.0488091992440169E-2}]
[null,"2013 for Pay 2014",38876125,{"$f":"(C7-C6)/C6","v":5.0657211322684151E-2}]
[null,"2014 for Pay 2015",43710245,0.12434675523859438]
[null,"2015 for Pay 2016",46059927,5.375586432883183E-2,null,null,null,null,{"$f":"'Scott Co Prelim Data'!E125","v":61065169}]
[null,"2016 for Pay 2017",{"$f":"District!H19","v":48946987},6.2680516189267954E-2,null,null,null,null,{"$f":"District!I19","v":5983205}]
[null,"Est. 2017 for Pay 2018",{"$f":"C10*(1+'Tax Calculator'!$L$7)","v":51102882},4.4045509890118469E-2,null,null,null,null,{"$f":"I9-I10","v":55081964},null,{"$f":"I11-C10","v":6134977},{"$f":"K11/C10","v":0.12533921648742138}]
[null,"6-year Average",null,{"$f":"AVERAGE(D6:D11)","v":4.2499627496176105E-2}]

{"sheet":"District","index":10,"n_rows":60,"n_cols":14,"rows_kept":60,"cut":false,"hidden":false,"merged":[[56,1,56,2],[56,6,56,7],[57,0,57,3],[59,0,59,2],[60,0,62,10],[55,0,55,1],[43,0,43,1],[44,0,44,1],[46,0,46,1],[47,0,47,1],[48,0,48,1],[49,0,49,1],[50,0,50,1],[51,0,51,1],[52,0,52,1],[53,0,53,1],[54,0,54,1],[42,0,42,1],[8,0,8,2],[21,0,21,2],[33,0,34,9],[35,0,35,2],[35,3,35,5],[35,6,35,7],[35,8,35,9],[36,0,36,2],[36,3,36,5],[36,6,36,7],[36,8,36,9],[39,0,39,1],[6,1,6,2],[6,3,6,5],[6,6,6,7],[6,8,6,9],[0,2,0,3],[0,4,2,9],[1,2,1,3],[4,0,4,10],[5,0,5,2],[5,3,5,5],[5,6,5,7],[5,8,5,9],[1,10,2,10],[2,2,2,3],[3,0,3,10]]}
[null,null,"Division of School Finance",null,"S C H O O L   T A X   R E P O R T   -   2 0 1 6   P A Y A B L E   2 0 1 7",null,null,null,null,null,"ED-00119-40"]
[null,null,"1500 Highway 36 West",null,null,null,null,null,null,null,"DUE:  04/01/2016"]
[null,null,"Roseville, MN  55113-4266"]
["GENERAL INSTRUCTIONS AND INFORMATION:  Please read the INSTRUCTIONS FOR COMPLETION on the Instructions tab before completing this report."]
["I D E N T I F I C A T I O N   A N D   G E N E R A L   I N F O R M A T I O N"]
["District Number and Name",null,null,"County Auditor's Office Contact Person",null,null,"Telephone Number",null,"County Name",null,"Date"]
[720,{"$f":"VLOOKUP(A7,Counties!C:F,4,FALSE)","v":"Shakopee Public School District"},null,null,null,null,null,null,{"$f":"VLOOKUP(A7,Counties!C:J,8,FALSE)","v":"Scott Co"}]
[]
["Valuation Excluding JOBZ"]
[null,"(1)","(2)","(3)","(4)**","(5)**","(6)**","(7)","(8)","(9)","(10)"]
["CO. NO.","REAL AGRIC NET TAX CAPACITY","REAL NON AGRIC NET TAX CAPACITY","PERSONAL NET TAX CAPACITY","TAX INCREMENT NET TAX CAPACITY","10% OF 200KV TRANSLINES","FINAL CONTRIBUTION NET TAX CAPACITY","INITIAL TAX RATE DETERMINATION VALUE","FINAL DISTRIBUTION NET TAX CAPACITY","TOTAL TAXABLE NET TAX CAPACITY","SCHOOL DISTRICT REFERENDUM MARKET VALUE (\"SD Ref MV\")"]
[null,"(Dollars Only)","(Dollars Only)","(Dollars Only)","(Dollars Only)","(Dollars Only)","(Dollars Only)","(Sum Cols. 1-6)","(Dollars Only)","(Columns 7 + 8)","(Dollars Only)"]
[null,"Item #60","Item #70","Items #80+90","Item #120","Item #110","Item #130","Item #140","Item #150",null,"Item #1925"]
[]
[]
[]
[]
[]
["TOTAL",{"$f":"VLOOKUP(A7,'Page 1'!$A$3:$O$527,3,FALSE)","v":1225349},{"$f":"VLOOKUP(A7,'Page 1'!$A$3:$O$527,4,FALSE)","v":55003162},{"$f":"VLOOKUP(A7,'Page 1'!$A$3:$O$527,5,FALSE)","v":776727},{"$f":"VLOOKUP(A7,'Page 1'!$A$3:$O$527,6,FALSE)","v":-827765},{"$f":"VLOOKUP(A7,'Page 1'!$A$3:$O$527,7,FALSE)","v":0},{"$f":"VLOOKUP(A7,'Page 1'!$A$3:$O$527,8,FALSE)","v":-7230486},{"$f":"VLOOKUP(A7,'Page 1'!$A$3:$O$527,9,FALSE)","v":48946987},{"$f":"VLOOKUP(A7,'Page 1'!$A$3:$O$527,10,FALSE)","v":5983205},{"$f":"VLOOKUP(A7,'Page 1'!$A$3:$O$527,11,FALSE)","v":54930192},{"$f":"VLOOKUP(A7,'Page 1'!$A$3:$O$527,12,FALSE)","v":4606879600}]
[]
[null,null,null,null,"Pay 2018 Prelim Info",null,null,null,null,{"$f":"'Scott Co Prelim Data'!$E$125","v":61065169},{"$f":"'Scott Co Prelim Data'!E235","v":4895229400}]
["JOBZ Valuation"]
[null,"(11)","(12)","(13)","(14)","(15)","(16)","(17)","(18)","(19)","(20)"]
["CO. NO.","REAL AGRIC NET TAX CAPACITY","REAL NON AGRIC NET TAX CAPACITY","PERSONAL NET TAX CAPACITY","TAX INCREMENT NET TAX CAPACITY","10% OF 200KV TRANSLINES","FINAL CONTRIBUTION NET TAX CAPACITY","INITIAL TAX RATE DETERMINATION VALUE","FINAL DISTRIBUTION NET TAX CAPACITY","TOTAL TAXABLE NET TAX CAPACITY","SCHOOL DISTRICT REFERENDUM MARKET VALUE (\"SD Ref MV\")"]
[null,"(Dollars Only)","(Dollars Only)","(Dollars Only)","(Dollars Only)","(Dollars Only)","(Dollars Only)","(Sum Cols. 11-16)","(Dollars Only)","(Cols. 17+18)","(Dollars Only)"]
[null,null,"Item #75","Item #95",null,null,null,"Item #105",null,null,"Item #1926"]
[]
[]
[]
[]
[]
["TOTAL",null,null,null,null,null,null,null,null,{"$f":"VLOOKUP(A7,'Page 1'!$A$3:$O$527,13,FALSE)","v":0},{"$f":"VLOOKUP(A7,'Page 1'!$A$3:$O$527,14,FALSE)","v":0}]
[]
["S C H O O L   T A X   R E P O R T   2 0 1 6   -   2 0 1 7   ( C O N T I N U E D )",null,null,null,null,null,null,null,null,null,"ED-00119-40"]
[null,null,null,null,null,null,null,null,null,null,"Page 2"]
["District Number and Name",null,null,"County Auditor's Office Contact Person",null,null,"Telephone Number",null,"County Name",null,"Date"]
[]
[]
[null,null,"(21)","(22)","(23)**","(24)","(25)",null,"(26)","(27)"]
["TYPE OF SCHOOL PROPERTY TAX LEVY",null,"CERTIFIED\nLEVY","COUNTY\nAUDITOR\nADJUSTMENT","FISCAL DISPARITIES ADJUSTMENT","ADJUSTED\nLEVY","INITIAL\nTAX RATE","2011\nABSTRACT OF\nTAX LISTS","COMPUTED\nLEVY","DIFFERENCE"]
[null,null,"(Dollars & Cents)","(Dollars & Cents)","(Dollars & Cents)","(Col. 21 + 22 + 23)",null,"ITEM #","(Dollars & Cents)","(Dollars & Cents)"]
[]
["1) GENERAL RMV VOTER\n     JOBZ Exempt",null,{"$f":"VLOOKUP(A7,'Page 2 Top'!$A$3:$U$527,4,FALSE)","v":0},{"$f":"VLOOKUP(A7,'Page 2 Top'!$A$3:$U$527,5,FALSE)","v":0},{"$f":"VLOOKUP(A7,'Page 2 Top'!$A$3:$U$527,6,FALSE)","v":0},{"$f":"VLOOKUP(A7,'Page 2 Top'!$A$3:$U$527,7,FALSE)","v":0},{"$f":"VLOOKUP(A7,'Page 2 Top'!$A$3:$U$527,8,FALSE)","v":0},"2000",{"$f":"VLOOKUP(A7,'Page 2 Top'!$A$3:$U$527,9,FALSE)","v":0},{"$f":"IF(ABS(($K$19*G43/100)-F43)>ABS($K$19*0.0000001),($K$19*G43/100)-F43,0)","v":0},"(Col. 10 x Col. 25)\n - Col. 24"]
["2) GENERAL RMV OTHER\n    JOBZ Exempt",null,{"$f":"VLOOKUP(A7,'Page 2 Top'!$A$3:$U$527,10,FALSE)","v":5991217},{"$f":"VLOOKUP(A7,'Page 2 Top'!$A$3:$U$527,11,FALSE)","v":0},{"$f":"VLOOKUP(A7,'Page 2 Top'!$A$3:$U$527,12,FALSE)","v":-703983},{"$f":"VLOOKUP(A7,'Page 2 Top'!$A$3:$U$527,13,FALSE)","v":5287234},{"$f":"VLOOKUP(A7,'Page 2 Top'!$A$3:$U$527,14,FALSE)","v":0.11477},"2005",{"$f":"VLOOKUP(A7,'Page 2 Top'!$A$3:$U$527,15,FALSE)","v":5287233.71},{"$f":"IF(ABS(($K$19*G44/100)-F44)>ABS($K$19*0.0000001),($K$19*G44/100)-F44,0)","v":0},"(Col. 10 x Col. 25)\n- Col. 24"]
["SUBTOTAL  (Spread on SD Ref MV)",null,{"$f":"VLOOKUP(A7,'Page 2 Top'!$A$3:$U$527,16,FALSE)","v":5991217},{"$f":"VLOOKUP(A7,'Page 2 Top'!$A$3:$U$527,17,FALSE)","v":0},{"$f":"VLOOKUP(A7,'Page 2 Top'!$A$3:$U$527,18,FALSE)","v":-703983},{"$f":"VLOOKUP(A7,'Page 2 Top'!$A$3:$U$527,19,FALSE)","v":5287234},{"$f":"VLOOKUP(A7,'Page 2 Top'!$A$3:$U$527,20,FALSE)","v":0.11477},"2010",{"$f":"VLOOKUP(A7,'Page 2 Top'!$A$3:$U$527,21,FALSE)","v":5287233.71},{"$f":"SUM(J43:J44)","v":0},null,null,null,{"$f":"G45/100*'2017 Neighbor Comparison Graph'!M40","v":229.54}]
[]
["3) GENERAL NTC VOTER\n    JOBZ Exempt",null,{"$f":"VLOOKUP(A7,'Page 2 Middle'!$A$3:$AA$527,4,FALSE)","v":3011717},{"$f":"VLOOKUP(A7,'Page 2 Middle'!$A$3:$AA$527,5,FALSE)","v":0},{"$f":"VLOOKUP(A7,'Page 2 Middle'!$A$3:$AA$527,6,FALSE)","v":-352741},{"$f":"VLOOKUP(A7,'Page 2 Middle'!$A$3:$AA$527,7,FALSE)","v":2658976},{"$f":"VLOOKUP(A7,'Page 2 Middle'!$A$3:$AA$527,8,FALSE)","v":5.4320000000000004},"720",{"$f":"VLOOKUP(A7,'Page 2 Middle'!$A$3:$AA$527,9,FALSE)","v":2658976},{"$f":"IF(ABS(($H$19*G47/100)-F47)>ABS($H$19*0.00001),($H$19*G47/100)-F47,0)","v":0},"(Col. 7 x Col. 25)\n- Col. 24"]
["4) GENERAL NTC OTHER JOBZ Exempt",null,{"$f":"VLOOKUP(A7,'Page 2 Middle'!$A$3:$AA$527,10,FALSE)","v":74895},{"$f":"VLOOKUP(A7,'Page 2 Middle'!$A$3:$AA$527,11,FALSE)","v":0},{"$f":"VLOOKUP(A7,'Page 2 Middle'!$A$3:$AA$527,12,FALSE)","v":-8772},{"$f":"VLOOKUP(A7,'Page 2 Middle'!$A$3:$AA$527,13,FALSE)","v":66123},{"$f":"VLOOKUP(A7,'Page 2 Middle'!$A$3:$AA$527,14,FALSE)","v":0.13500000000000001},"722",{"$f":"VLOOKUP(A7,'Page 2 Middle'!$A$3:$AA$527,15,FALSE)","v":66123},{"$f":"IF(ABS(($H$19*G48/100)-F48)>ABS($H$19*0.00001),($H$19*G48/100)-F48,0)","v":0},"(Col. 7 x Col. 25)\n- Col. 24"]
["5) GENERAL NTC OTHER\n    JOBZ Exempt",null,{"$f":"VLOOKUP(A7,'Page 2 Middle'!$A$3:$AA$527,16,FALSE)","v":4644540},{"$f":"VLOOKUP(A7,'Page 2 Middle'!$A$3:$AA$527,17,FALSE)","v":0},{"$f":"VLOOKUP(A7,'Page 2 Middle'!$A$3:$AA$527,18,FALSE)","v":-543982},{"$f":"VLOOKUP(A7,'Page 2 Middle'!$A$3:$AA$527,19,FALSE)","v":4100558},{"$f":"VLOOKUP(A7,'Page 2 Middle'!$A$3:$AA$527,20,FALSE)","v":8.3780000000000001},"725",{"$f":"VLOOKUP(A7,'Page 2 Middle'!$A$3:$AA$527,21,FALSE)","v":4100558},{"$f":"IF(ABS(($H$19*G49/100)-F49)>ABS($H$19*0.00001),($H$19*G49/100)-F49,0)","v":0},"(Col. 7 x Col. 25)\n- Col. 24"]
["6) COMMUNITY SERV\n     NTC OTHER\n     JOBZ Exempt",null,{"$f":"VLOOKUP(A7,'Page 2 Middle'!$A$3:$AA$527,22,FALSE)","v":586043},{"$f":"VLOOKUP(A7,'Page 2 Middle'!$A$3:$AA$527,23,FALSE)","v":0},{"$f":"VLOOKUP(A7,'Page 2 Middle'!$A$3:$AA$527,24,FALSE)","v":-68639},{"$f":"VLOOKUP(A7,'Page 2 Middle'!$A$3:$AA$527,25,FALSE)","v":517404},{"$f":"VLOOKUP(A7,'Page 2 Middle'!$A$3:$AA$527,26,FALSE)","v":1.0569999999999999},"740",{"$f":"VLOOKUP(A7,'Page 2 Middle'!$A$3:$AA$527,27,FALSE)","v":517404},{"$f":"IF(ABS(($H$19*G50/100)-F50)>ABS($H$19*0.00001),($H$19*G50/100)-F50,0)","v":0},"(Col. 7 x Col. 25)\n- Col. 24"]
["7) GENERAL DEBT SERV\n    VOTER APPROVED\n    JOBZ Non-Exempt",null,{"$f":"VLOOKUP(A7,'Page 2 Bottom'!$A$3:$W$527,4,FALSE)","v":19004667},{"$f":"VLOOKUP(A7,'Page 2 Bottom'!$A$3:$W$527,5,FALSE)","v":0},{"$f":"VLOOKUP(A7,'Page 2 Bottom'!$A$3:$W$527,6,FALSE)","v":-2225881},{"$f":"VLOOKUP(A7,'Page 2 Bottom'!$A$3:$W$527,7,FALSE)","v":16778786},{"$f":"VLOOKUP(A7,'Page 2 Bottom'!$A$3:$W$527,8,FALSE)","v":34.28},"745",{"$f":"VLOOKUP(A7,'Page 2 Bottom'!$A$3:$W$527,9,FALSE)","v":16778786},{"$f":"IF(ABS((($H$19+$J$32)*G51/100)-F51)>ABS(($H$19+$J$32)*0.00001),(($H$19+$J$32)*G51/100)-F51,0)","v":0},"[(Col. 7 + 17) x\nCol. 25] - Col. 24"]
["8) GENERAL DEBT SERV\n    OTHER\n    JOBZ Non-Exempt",null,{"$f":"VLOOKUP(A7,'Page 2 Bottom'!$A$3:$W$527,10,FALSE)","v":0},{"$f":"VLOOKUP(A7,'Page 2 Bottom'!$A$3:$W$527,11,FALSE)","v":0},{"$f":"VLOOKUP(A7,'Page 2 Bottom'!$A$3:$W$527,12,FALSE)","v":0},{"$f":"VLOOKUP(A7,'Page 2 Bottom'!$A$3:$W$527,13,FALSE)","v":0},{"$f":"VLOOKUP(A7,'Page 2 Bottom'!$A$3:$W$527,14,FALSE)","v":0},"755",{"$f":"VLOOKUP(A7,'Page 2 Bottom'!$A$3:$W$527,15,FALSE)","v":0},{"$f":"IF(ABS((($H$19+$J$32)*G52/100)-F52)>ABS(($H$19+$J$32)*0.00001),(($H$19+$J$32)*G52/100)-F52,0)","v":0},"[(Col. 7 + 17) x\nCol. 25] - Col. 24"]
["9) OPEB/PENSION DEBT\n    VOTER APPROVED\n    JOBZ Non-Exempt",null,{"$f":"VLOOKUP(A7,'Page 2 OPEB'!$A$3:$O$527,4,FALSE)","v":0},{"$f":"VLOOKUP(A7,'Page 2 OPEB'!$A$3:$O$527,5,FALSE)","v":0},{"$f":"VLOOKUP(A7,'Page 2 OPEB'!$A$3:$O$527,6,FALSE)","v":0},{"$f":"VLOOKUP(A7,'Page 2 OPEB'!$A$3:$O$527,7,FALSE)","v":0},{"$f":"VLOOKUP(A7,'Page 2 OPEB'!$A$3:$O$527,8,FALSE)","v":0},"757",{"$f":"VLOOKUP(A7,'Page 2 OPEB'!$A$3:$O$527,9,FALSE)","v":0},{"$f":"IF(ABS((($H$19+$J$32)*G53/100)-F53)>ABS(($H$19+$J$32)*0.00001),(($H$19+$J$32)*G53/100)-F53,0)","v":0},"[(Col. 7 + 17) x\nCol. 25] - Col. 24"]
["10) OPEB/PENSION DEBT\n     OTHER\n    JOBZ Non-Exempt",null,{"$f":"VLOOKUP(A7,'Page 2 OPEB'!$A$3:$O$527,10,FALSE)","v":0},{"$f":"VLOOKUP(A7,'Page 2 OPEB'!$A$3:$O$527,11,FALSE)","v":0},{"$f":"VLOOKUP(A7,'Page 2 OPEB'!$A$3:$O$527,12,FALSE)","v":0},{"$f":"VLOOKUP(A7,'Page 2 OPEB'!$A$3:$O$527,13,FALSE)","v":0},{"$f":"VLOOKUP(A7,'Page 2 OPEB'!$A$3:$O$527,14,FALSE)","v":0},760,{"$f":"VLOOKUP(A7,'Page 2 OPEB'!$A$3:$O$527,15,FALSE)","v":0},{"$f":"IF(ABS((($H$19+$J$32)*G54/100)-F54)>ABS(($H$19+$J$32)*0.00001),(($H$19+$J$32)*G54/100)-F54,0)","v":0},"[(Col. 7 + 17) x\nCol. 25] - Col. 24"]
["SUBTOTAL  (Spread on NTC)",null,{"$f":"VLOOKUP(A7,'Page 2 Bottom'!$A$3:$W$527,16,FALSE)","v":27321862},{"$f":"VLOOKUP(A7,'Page 2 Bottom'!$A$3:$W$527,17,FALSE)","v":0},{"$f":"VLOOKUP(A7,'Page 2 Bottom'!$A$3:$W$527,18,FALSE)","v":-3200015},{"$f":"VLOOKUP(A7,'Page 2 Bottom'!$A$3:$W$527,19,FALSE)","v":24121847},{"$f":"VLOOKUP(A7,'Page 2 Bottom'!$A$3:$W$527,20,FALSE)","v":49.281999999999996},"770",{"$f":"VLOOKUP(A7,'Page 2 Bottom'!$A$3:$W$527,21,FALSE)","v":24121847},{"$f":"SUM(J47:J54)","v":0},null,null,null,{"$f":"G55/100*'2017 Neighbor Comparison Graph'!J40","v":891.01855999999998}]
["TOTAL FOR ALL LEVIES",null,{"$f":"C45+C55","v":33313079},{"$f":"D45+D55","v":0},{"$f":"E45+E55","v":-3903998},{"$f":"F45+F55","v":29409081},null,null,{"$f":"I55+I45","v":29409080.710000001},{"$f":"J45+J55","v":0},null,null,null,{"$f":"N55+N45","v":1120.5585599999999}]
[null,null,null,null,null,null,"Total Disparity Aid**",null,{"$f":"VLOOKUP(A7,'Page 2 Bottom'!$A$3:$W$527,22,FALSE)*-1","v":-280}]
["**Enter as a negative amount.",null,null,null,null,null,null,"Total Spread Levy",{"$f":"VLOOKUP(A7,'Page 2 Bottom'!$A$3:$W$527,23,FALSE)","v":29408800.710000001}]
[]
["Explanation of differences:"]

{"sheet":"Ag2School Tax Impact","index":11,"n_rows":43,"n_cols":28,"rows_kept":43,"cut":false,"hidden":false,"merged":[[36,0,38,0],[8,0,18,0],[8,5,18,5],[20,0,22,0],[20,5,22,5],[25,0,25,6],[28,0,28,6]]}
[{"$f":"CONCATENATE(\"ISD \",District!A7,\" - \",District!B7)","v":"ISD 720 - Shakopee Public School District"}]
[]
["Date prepared: June 15, 2017"]
[]
[]
[null,null,null,null,"Total School Portion of Taxes","Est. AG Tax Credit Changes (based on Pay 2017 figures)","Net Impact if Ag2School would have been available Last Year",null,null,"Voter Approved Bonds","Other Debt Service"]
["Type of Property","Estimated Market Value","Referendum Market Value","Net Tax Capacity","Pay 2017","Potential Change","Net Hypothetical ",null,null,"Pay 2017","Pay 2017",null,null,null,null,null,"NTC",null,null,"RMV"]
[]
["Residential Homestead",75000,{"$f":"T9","v":75000},{"$f":"Q9","v":450},{"$f":"($C9*E$42)+($D9*E$43)","v":307.84649999999999},"NOT APPLICABLE",{"$f":"E9","v":307.84649999999999},null,null,{"$f":"($C9*J$42)+($D9*J$43)","v":154.26},0,null,null,null,null,null,{"$f":"ROUND((0.01*MIN(500000,B9)+0.0125*MAX(B9-500000,0))-AA9,0)","v":450},null,null,{"$f":"B9","v":75000},0.4,{"$f":"MIN(T9*U9,30400)","v":30000},{"$f":"IF(T9>76000,T9-76000,0)","v":0},0.09,{"$f":"W9*X9","v":0},{"$f":"MAX(V9-Y9,0)","v":30000},{"$f":"ROUND((0.01*MIN(500000,Z9)+0.0125*MAX(Z9-500000,0)),0)","v":300}]
[null,{"$f":"B9+25000","v":100000},{"$f":"T10","v":100000},{"$f":"Q10","v":718},468.61475999999999,null,{"$f":"E10","v":468.61475999999999},null,null,246.13040000000001,0,null,null,null,null,null,718,null,null,100000,0.4,{"$f":"MIN(T10*U10,30400)","v":30400},{"$f":"IF(T10>76000,T10-76000,0)","v":24000},0.09,{"$f":"W10*X10","v":2160},{"$f":"MAX(V10-Y10,0)","v":28240},{"$f":"ROUND((0.01*MIN(500000,Z10)+0.0125*MAX(Z10-500000,0)),0)","v":282}]
[null,{"$f":"B10+25000","v":125000},125000,990,631.35429999999997,null,631.35429999999997,null,null,339.37200000000001,0,null,null,null,null,null,990,null,null,125000,0.4,30400,49000,0.09,4410,25990,260]
[null,150000,150000,1263,794.58665999999994,null,794.58665999999994,null,null,432.95639999999997,0,null,null,null,null,null,1263,null,null,150000,0.4,30400,74000,0.09,6660,23740,237]
[null,175000,175000,1535,957.32619999999997,null,957.32619999999997,null,null,526.19799999999998,0,null,null,null,null,null,1535,null,null,175000,0.4,30400,99000,0.09,8910,21490,215]
[null,200000,200000,1808,1120.5585599999999,null,1120.5585599999999,null,null,619.78239999999994,0,null,null,null,null,null,1808,null,null,200000,0.4,30400,124000,0.09,11160,19240,192]
[null,{"$f":"B14+50000","v":250000},250000,2353,1446.5304599999999,null,1446.5304599999999,null,null,806.60839999999996,0,null,null,null,null,null,2353,null,null,250000,0.4,30400,174000,0.09,15660,14740,147]
[null,{"$f":"B15+50000","v":300000},300000,2898,1772.50236,null,1772.50236,null,null,993.43439999999998,0,null,null,null,null,null,2898,null,null,300000,0.4,30400,224000,0.09,20160,10240,102]
[null,{"$f":"B16+50000","v":350000},350000,3443,2098.47426,null,2098.47426,null,null,1180.2603999999999,0,null,null,null,null,null,3443,null,null,350000,0.4,30400,274000,0.09,24660,5740,57]
[null,{"$f":"B17+50000","v":400000},{"$f":"T18","v":400000},{"$f":"Q18","v":3988},2424.44616,null,2424.44616,null,null,1367.0863999999999,0,null,null,null,null,null,3988,null,null,400000,0.4,{"$f":"MIN(T18*U18,30400)","v":30400},{"$f":"IF(T18>76000,T18-76000,0)","v":324000},0.09,{"$f":"W18*X18","v":29160},{"$f":"MAX(V18-Y18,0)","v":1240},{"$f":"ROUND((0.01*MIN(500000,Z18)+0.0125*MAX(Z18-500000,0)),0)","v":12}]
[null,500000,{"$f":"T19","v":500000},{"$f":"Q19","v":5000},3037.95,null,3037.95,null,null,1714,0,null,null,null,null,null,5000,null,null,500000,0.4,{"$f":"MIN(T19*U19,30400)","v":30400},{"$f":"IF(T19>76000,T19-76000,0)","v":424000},0.09,{"$f":"W19*X19","v":38160},{"$f":"MAX(V19-Y19,0)","v":0},{"$f":"ROUND((0.01*MIN(500000,Z19)+0.0125*MAX(Z19-500000,0)),0)","v":0}]
[]
["Commercial Industrial",250000,{"$f":"T21","v":250000},{"$f":"Q21","v":4250},{"$f":"($C21*E$42)+($D21*E$43)","v":2381.4100000000003},"N / A",{"$f":"E21","v":2381.4100000000003},null,null,{"$f":"($C21*J$42)+($D21*J$43)","v":1456.8999999999999},{"$f":"($C21*K$42)+($D21*K$43)","v":0},null,null,null,null,null,{"$f":"(0.015*MIN(150000,B21)+0.02*MAX(B21-150000,0))","v":4250},null,null,{"$f":"B21","v":250000}]
[null,500000,{"$f":"T22","v":500000},{"$f":"Q22","v":9250},5132.4350000000004,null,{"$f":"E22","v":5132.4350000000004},null,null,{"$f":"($C22*J$42)+($D22*J$43)","v":3170.9},0,null,null,null,null,null,{"$f":"(0.015*MIN(150000,B22)+0.02*MAX(B22-150000,0))","v":9250},null,null,{"$f":"B22","v":500000}]
[null,1000000,{"$f":"T23","v":1000000},{"$f":"Q23","v":19250},10634.485000000001,null,10634.485000000001,null,null,6598.9,0,null,null,null,null,null,{"$f":"(0.015*MIN(150000,B23)+0.02*MAX(B23-150000,0))","v":19250},null,null,{"$f":"B23","v":1000000}]
[]
["Agricultural Homestead *",{"$f":"(P25*S25)+R25","v":1104000},{"$f":"T25","v":150000},{"$f":"Q25","v":6033},{"$f":"($C25*E$42)+($D25*E$43)","v":3145.33806},{"$f":"F37","v":-654.06240000000003},{"$f":"E25+F25","v":2491.2756600000002},null,null,{"$f":"($C25*J$42)+($D25*J$43)","v":2068.1124},{"$f":"($C25*K$42)+($D25*K$43)","v":0},null,null,null,null,160,{"$f":"0.01*MIN(500000,$T25)+0.0125*MAX($T25-500000,0)+0.01*MAX($B25-$T25-2050000,0)+0.005*MIN(2050000,$B25-$T25)-AB25","v":6033},144000,6000,{"$f":"R25+S25","v":150000},{"$f":"T25","v":150000},0.4,{"$f":"MIN(U25*V25,30400)","v":30400},{"$f":"IF(U25>76000,U25-76000,0)","v":74000},0.09,{"$f":"X25*Y25","v":6660},{"$f":"MAX(W25-Z25,0)","v":23740},{"$f":"ROUND((0.01*MIN(500000,AA25)+0.0125*MAX(AA25-500000,0)),0)","v":237}]
[{"$f":"CONCATENATE(\"* - Property value assumes \",TEXT(P25,\"000\"),\" acres with a dwelling value of \",TEXT(T25,\"$0,000\"),\" (house, garage and one acre) at an assessed value of \",TEXT(S25,\"$0,000\"),\" per acre\")","v":"* - Property value assumes 160 acres with a dwelling value of $150,000 (house, garage and one acre) at an assessed value of $6,000 per acre"}]
[]
["Agricultural Homestead **",{"$f":"(P28*S28)+R28","v":2064000},{"$f":"T28","v":150000},{"$f":"Q28","v":10833},{"$f":"($C28*E$42)+($D28*E$43)","v":5510.8740599999992},{"$f":"F38","v":-1312.2384000000002},{"$f":"E28+F28","v":4198.635659999999},null,null,{"$f":"($C28*J$42)+($D28*J$43)","v":3713.5524},{"$f":"($C28*K$42)+($D28*K$43)","v":0},null,null,null,null,320,{"$f":"0.01*MIN(500000,$T28)+0.0125*MAX($T28-500000,0)+0.01*MAX($B28-$T28-2050000,0)+0.005*MIN(2050000,$B28-$T28)-AB28","v":10833},{"$f":"R25","v":144000},{"$f":"S25","v":6000},{"$f":"R28+S28","v":150000},{"$f":"T28","v":150000},0.4,{"$f":"MIN(U28*V28,30400)","v":30400},{"$f":"IF(U28>76000,U28-76000,0)","v":74000},0.09,{"$f":"X28*Y28","v":6660},{"$f":"MAX(W28-Z28,0)","v":23740},{"$f":"ROUND((0.01*MIN(500000,AA28)+0.0125*MAX(AA28-500000,0)),0)","v":237}]
[{"$f":"CONCATENATE(\"** - Property value assumes \",TEXT(P28,\"000\"),\" acres with a dwelling value of \",TEXT(T28,\"$0,000\"),\" (house, garage and one acre) at an assessed value of \",TEXT(S28,\"$0,000\"),\" per acre\")","v":"** - Property value assumes 320 acres with a dwelling value of $150,000 (house, garage and one acre) at an assessed value of $6,000 per acre"}]
[]
["Non-homestead Agricultural",{"$f":"S28","v":6000},{"$f":"T31","v":0},{"$f":"Q31","v":60},{"$f":"($C31*E$42)+($D31*E$43)","v":29.569199999999999},{"$f":"F39","v":-8.2271999999999998},{"$f":"E31+F31","v":21.341999999999999},null,null,{"$f":"($C31*J$42)+($D31*J$43)","v":20.567999999999998},{"$f":"($C31*K$42)+($D31*K$43)","v":0},null,null,null,null,null,{"$f":"B31*0.01","v":60},null,null,{"$f":"B31*0","v":0}]
[]
["TAX IMPACT ESTIMATES with 40% AGRICULTURAL CREDIT shown in turquoise shade"]
["Agricultural Homestead *",{"$f":"B25","v":1104000},{"$f":"C25","v":150000},{"$f":"D25","v":6033},null,null,null,null,null,{"$f":"(($D34-$Q34)*J$43*0.6)+($Q34*J$43)","v":1414.05},{"$f":"(($D34-$Q34)*K$43*0.6)+($Q34*K$43)","v":0},null,null,null,null,null,{"$f":"ROUND((0.01*MIN(500000,T34)+0.0125*MAX(T34-500000,0))-AA34,0)","v":1263},null,null,{"$f":"T25","v":150000},0.4,{"$f":"MIN(T34*U34,30400)","v":30400},{"$f":"IF(T34>76000,T34-76000,0)","v":74000},0.09,{"$f":"W34*X34","v":6660},{"$f":"MAX(V34-Y34,0)","v":23740},{"$f":"ROUND((0.01*MIN(500000,Z34)+0.0125*MAX(Z34-500000,0)),0)","v":237}]
["Agricultural Homestead **",{"$f":"B28","v":2064000},{"$f":"C28","v":150000},{"$f":"D28","v":10833},null,null,null,null,null,{"$f":"(($D35-$Q35)*J$43*0.6)+($Q35*J$43)","v":2401.3139999999999},{"$f":"(($D35-$Q35)*K$43*0.6)+($Q35*K$43)","v":0},null,null,null,null,null,{"$f":"ROUND((0.01*MIN(500000,T35)+0.0125*MAX(T35-500000,0))-AA35,0)","v":1263},null,null,{"$f":"T28","v":150000},0.4,{"$f":"MIN(T35*U35,30400)","v":30400},{"$f":"IF(T35>76000,T35-76000,0)","v":74000},0.09,{"$f":"W35*X35","v":6660},{"$f":"MAX(V35-Y35,0)","v":23740},{"$f":"ROUND((0.01*MIN(500000,Z35)+0.0125*MAX(Z35-500000,0)),0)","v":237}]
["Non-homestead Agricultural",{"$f":"B31","v":6000},0,{"$f":"B36*0.01","v":60},null,null,null,null,null,{"$f":"(($D36-$Q36)*J$43*0.6)+($Q36*J$43)","v":12.340799999999998},0]
["Estimated Ag Credit Difference","Hmstd Ag#1",null,null,null,{"$f":"J37+K37","v":-654.06240000000003},null,null,null,{"$f":"J34-J25","v":-654.06240000000003},{"$f":"K34-K25","v":0}]
[null,"Hmstd Ag#2",null,null,null,{"$f":"J38+K38","v":-1312.2384000000002},null,null,null,{"$f":"J35-J28","v":-1312.2384000000002},{"$f":"K35-K28","v":0}]
[null,"NonHmstd Ag",null,null,null,{"$f":"J39+K39","v":-8.2271999999999998},null,null,null,{"$f":"J36-J31","v":-8.2271999999999998},{"$f":"K36-K31","v":0}]
[]
[]
[null,null,null,"RMV",{"$f":"District!G45/100","v":1.1477E-3}]
[null,null,null,"NTC",{"$f":"District!G55/100","v":0.49281999999999998},{"$f":"J43+K43","v":0.34279999999999999},null,null,null,{"$f":"District!G51/100","v":0.34279999999999999},{"$f":"District!G52/100","v":0}]

{"sheet":"2017 Neighbor Comparison Graph","index":12,"n_rows":51,"n_cols":20,"rows_kept":51,"cut":false,"hidden":false,"merged":[[4,0,4,7]]}
[]
[null,"District #","District Name"]
[null,{"$f":"District!A7","v":720},{"$f":"District!B7","v":"Shakopee Public School District"}]
[]
["PAY 2017 SCHOOL DISTRICT NEIGHBOR COMPARISON GRAPH"]
[]
[null,null,null,null,null,null,null,null,null,null,null,{"$f":"CONCATENATE(\"School Portion of Property Taxes Payable in 2017 on a \",TEXT(M40,\"$0,000\"),\" Homestead Residential Property\")","v":"School Portion of Property Taxes Payable in 2017 on a $200,000 Homestead Residential Property"}]
[]
[]
[]
[]
[]
[]
[]
[]
[]
[]
[]
[]
[]
[]
[]
[]
[]
[]
[]
[]
[]
[]
[]
[]
[]
[]
[]
[]
[]
[]
[]
[null,"Enter District # Below","District Name","RMV Rate","NTC Rate","RMV Portion of Property Tax","NTC Portion of Property Tax","Total Property Tax*",null,"NTC of Property",null,null,"Market Value",null,null,null,null,null,null,"MV Exclusion"]
[null,null,"AVG STATE OF MN",{"$f":"'Page 2 Top'!T535/100","v":2.1960634441087618E-3},{"$f":"'Page 2 Bottom'!T535/100","v":0.20681543806646513},{"$f":"ROUND(D40*M40,2)","v":439.21},{"$f":"ROUND(E40*J40,2)","v":373.92},{"$f":"F40+G40","v":813.13},null,{"$f":"ROUND((0.01*MIN(500000,M40)+0.0125*MAX(M40-500000,0))-T40,0)","v":1808},null,null,200000,0.4,{"$f":"MIN(M40*N40,30400)","v":30400},{"$f":"IF(M40>76000,M40-76000,0)","v":124000},0.09,{"$f":"P40*Q40","v":11160},{"$f":"MAX(O40-R40,0)","v":19240},{"$f":"ROUND((0.01*MIN(500000,S40)+0.0125*MAX(S40-500000,0)),0)","v":192}]
[null,272,{"$f":"VLOOKUP(B41,Counties!C:F,4,FALSE)","v":"Eden Prairie Public School District"},{"$f":"VLOOKUP(B41,'Page 2 Top'!$A$3:$U$527,20,FALSE)/100","v":2.2012999999999998E-3},{"$f":"VLOOKUP(B41,'Page 2 Bottom'!$A$3:$W$527,20,FALSE)/100","v":0.21864999999999998},440.26,395.32,835.57999999999993,null,1808,null,null,{"$f":"$M$40","v":200000},0.4,30400,124000,0.09,11160,19240,192]
[null,717,{"$f":"VLOOKUP(B42,Counties!C:F,4,FALSE)","v":"Jordan Public School District"},{"$f":"VLOOKUP(B42,'Page 2 Top'!$A$3:$U$527,20,FALSE)/100","v":1.2452000000000001E-3},{"$f":"VLOOKUP(B42,'Page 2 Bottom'!$A$3:$W$527,20,FALSE)/100","v":0.33805000000000002},249.04,611.19000000000005,860.23,null,1808,null,null,200000,0.4,30400,124000,0.09,11160,19240,192]
[null,191,{"$f":"VLOOKUP(B43,Counties!C:F,4,FALSE)","v":"Burnsville Public School District"},{"$f":"VLOOKUP(B43,'Page 2 Top'!$A$3:$U$527,20,FALSE)/100","v":2.3335999999999999E-3},{"$f":"VLOOKUP(B43,'Page 2 Bottom'!$A$3:$W$527,20,FALSE)/100","v":0.27528999999999998},466.72,497.72,964.44,null,1808,null,null,200000,0.4,30400,124000,0.09,11160,19240,192]
[null,719,{"$f":"VLOOKUP(B44,Counties!C:F,4,FALSE)","v":"Prior Lake-Savage Area Schools"},{"$f":"VLOOKUP(B44,'Page 2 Top'!$A$3:$U$527,20,FALSE)/100","v":2.0431E-3},{"$f":"VLOOKUP(B44,'Page 2 Bottom'!$A$3:$W$527,20,FALSE)/100","v":0.30664000000000002},408.62,554.41,963.03,null,1808,null,null,200000,0.4,30400,124000,0.09,11160,19240,192]
[null,196,{"$f":"VLOOKUP(B45,Counties!C:F,4,FALSE)","v":"Rosemount-Apple Valley-Eagan"},{"$f":"VLOOKUP(B45,'Page 2 Top'!$A$3:$U$527,20,FALSE)/100","v":2.738E-3},{"$f":"VLOOKUP(B45,'Page 2 Bottom'!$A$3:$W$527,20,FALSE)/100","v":0.23335999999999998},547.6,421.91,969.51,null,1808,null,null,200000,0.4,30400,124000,0.09,11160,19240,192]
[null,276,{"$f":"VLOOKUP(B46,Counties!C:F,4,FALSE)","v":"Minnetonka Public School District"},{"$f":"VLOOKUP(B46,'Page 2 Top'!$A$3:$U$527,20,FALSE)/100","v":2.9965999999999999E-3},{"$f":"VLOOKUP(B46,'Page 2 Bottom'!$A$3:$W$527,20,FALSE)/100","v":0.22769999999999999},599.32000000000005,411.68,1011,null,1808,null,null,200000,0.4,30400,124000,0.09,11160,19240,192]
[null,194,{"$f":"VLOOKUP(B47,Counties!C:F,4,FALSE)","v":"Lakeville Public School District"},{"$f":"VLOOKUP(B47,'Page 2 Top'!$A$3:$U$527,20,FALSE)/100","v":2.5441000000000001E-3},{"$f":"VLOOKUP(B47,'Page 2 Bottom'!$A$3:$W$527,20,FALSE)/100","v":0.32913999999999999},508.82,595.09,1103.9100000000001,null,1808,null,null,200000,0.4,30400,124000,0.09,11160,19240,192]
[null,720,{"$f":"VLOOKUP(B48,Counties!C:F,4,FALSE)","v":"Shakopee Public School District"},{"$f":"VLOOKUP(B48,'Page 2 Top'!$A$3:$U$527,20,FALSE)/100","v":1.1477E-3},{"$f":"VLOOKUP(B48,'Page 2 Bottom'!$A$3:$W$527,20,FALSE)/100","v":0.49281999999999998},229.54,891.02,1120.56,null,1808,null,null,200000,0.4,30400,124000,0.09,11160,19240,192]
[null,112,{"$f":"VLOOKUP(B49,Counties!C:F,4,FALSE)","v":"Eastern Carver County Public School"},{"$f":"VLOOKUP(B49,'Page 2 Top'!$A$3:$U$527,20,FALSE)/100","v":2.3814999999999999E-3},{"$f":"VLOOKUP(B49,'Page 2 Bottom'!$A$3:$W$527,20,FALSE)/100","v":0.37006999999999995},476.3,669.09,1145.3900000000001,null,1808,null,null,200000,0.4,30400,124000,0.09,11160,19240,192]
[]
[null,"* - School Portion of Property Tax prior to any available Disparity Aid or Taconite Hmstd. Adjustments"]

{"sheet":"2017 Neighbor Comp Ag Graph","index":13,"n_rows":52,"n_cols":19,"rows_kept":52,"cut":false,"hidden":false,"merged":[[4,0,4,7]]}
[]
[null,"District #","District Name"]
[null,{"$f":"District!A7","v":720},{"$f":"District!B7","v":"Shakopee Public School District"}]
[]
["PAY 2017 SCHOOL DISTRICT NEIGHBOR COMPARISON GRAPH"]
[]
[null,null,null,null,null,null,null,null,null,null,null,{"$f":"CONCATENATE(\"School Portion of Property Taxes Payable in 2017 on a 1-acre Non-homestead Agricultural Property valued at \",TEXT(M40,\"$0,000\"))","v":"School Portion of Property Taxes Payable in 2017 on a 1-acre Non-homestead Agricultural Property valued at $12,000"}]
[]
[]
[]
[]
[]
[]
[]
[]
[]
[]
[]
[]
[]
[]
[]
[]
[]
[]
[]
[]
[]
[]
[]
[]
[]
[]
[]
[]
[]
[]
[]
[null,"Enter District # Below","District Name","RMV Rate","NTC Rate","RMV Portion of Property Tax","NTC Portion of Property Tax","Total Property Tax*",null,"NTC of Property",null,null,"Market Value",null,null,null,"Ag NTC","Total NTC"]
[null,null,"AVG STATE OF MN",{"$f":"'Page 2 Top'!T535/100","v":2.1960634441087618E-3},{"$f":"'Page 2 Bottom'!T535/100","v":0.20681543806646513},{"$f":"ROUND(D40*M40*0,2)","v":0},{"$f":"ROUND(E40*J40,2)","v":24.82},{"$f":"F40+G40","v":24.82},null,{"$f":"M40*0.01","v":120},null,null,12000]
[null,{"$f":"'2017 Neighbor Comparison Graph'!B41","v":272},{"$f":"VLOOKUP(B41,Counties!C:F,4,FALSE)","v":"Eden Prairie Public School District"},{"$f":"VLOOKUP(B41,'Page 2 Top'!$A$3:$U$527,20,FALSE)/100","v":2.2012999999999998E-3},{"$f":"VLOOKUP(B41,'Page 2 Bottom'!$A$3:$W$527,20,FALSE)/100","v":0.21864999999999998},0,26.24,26.24,null,120,null,null,{"$f":"$M$40","v":12000},null,null,null,{"$f":"VLOOKUP(B41,'Page 1'!$A$3:$O$527,3,FALSE)","v":44200},{"$f":"VLOOKUP(B41,'Page 1'!$A$3:$O$527,9,FALSE)","v":96069697},{"$f":"Q41/R41","v":4.600826418761371E-4}]
[null,{"$f":"'2017 Neighbor Comparison Graph'!B42","v":717},{"$f":"VLOOKUP(B42,Counties!C:F,4,FALSE)","v":"Jordan Public School District"},{"$f":"VLOOKUP(B42,'Page 2 Top'!$A$3:$U$527,20,FALSE)/100","v":1.2452000000000001E-3},{"$f":"VLOOKUP(B42,'Page 2 Bottom'!$A$3:$W$527,20,FALSE)/100","v":0.33805000000000002},0,40.57,40.57,null,120,null,null,12000,null,null,null,{"$f":"VLOOKUP(B42,'Page 1'!$A$3:$O$527,3,FALSE)","v":1695776},{"$f":"VLOOKUP(B42,'Page 1'!$A$3:$O$527,9,FALSE)","v":10623689},{"$f":"Q42/R42","v":0.15962214255330706}]
[null,{"$f":"'2017 Neighbor Comparison Graph'!B43","v":191},{"$f":"VLOOKUP(B43,Counties!C:F,4,FALSE)","v":"Burnsville Public School District"},{"$f":"VLOOKUP(B43,'Page 2 Top'!$A$3:$U$527,20,FALSE)/100","v":2.3335999999999999E-3},{"$f":"VLOOKUP(B43,'Page 2 Bottom'!$A$3:$W$527,20,FALSE)/100","v":0.27528999999999998},0,33.03,33.03,null,120,null,null,12000,null,null,null,{"$f":"VLOOKUP(B43,'Page 1'!$A$3:$O$527,3,FALSE)","v":37415},{"$f":"VLOOKUP(B43,'Page 1'!$A$3:$O$527,9,FALSE)","v":65110228},{"$f":"Q43/R43","v":5.7464089973698138E-4}]
[null,{"$f":"'2017 Neighbor Comparison Graph'!B44","v":719},{"$f":"VLOOKUP(B44,Counties!C:F,4,FALSE)","v":"Prior Lake-Savage Area Schools"},{"$f":"VLOOKUP(B44,'Page 2 Top'!$A$3:$U$527,20,FALSE)/100","v":2.0431E-3},{"$f":"VLOOKUP(B44,'Page 2 Bottom'!$A$3:$W$527,20,FALSE)/100","v":0.30664000000000002},0,36.799999999999997,36.799999999999997,null,120,null,null,12000,null,null,null,{"$f":"VLOOKUP(B44,'Page 1'!$A$3:$O$527,3,FALSE)","v":601261},{"$f":"VLOOKUP(B44,'Page 1'!$A$3:$O$527,9,FALSE)","v":49608304},{"$f":"Q44/R44","v":1.2120168429866096E-2}]
[null,{"$f":"'2017 Neighbor Comparison Graph'!B45","v":196},{"$f":"VLOOKUP(B45,Counties!C:F,4,FALSE)","v":"Rosemount-Apple Valley-Eagan"},{"$f":"VLOOKUP(B45,'Page 2 Top'!$A$3:$U$527,20,FALSE)/100","v":2.738E-3},{"$f":"VLOOKUP(B45,'Page 2 Bottom'!$A$3:$W$527,20,FALSE)/100","v":0.23335999999999998},0,28,28,null,120,null,null,12000,null,null,null,{"$f":"VLOOKUP(B45,'Page 1'!$A$3:$O$527,3,FALSE)","v":1185200},{"$f":"VLOOKUP(B45,'Page 1'!$A$3:$O$527,9,FALSE)","v":155699714},{"$f":"Q45/R45","v":7.6120884846326694E-3}]
[null,{"$f":"'2017 Neighbor Comparison Graph'!B46","v":276},{"$f":"VLOOKUP(B46,Counties!C:F,4,FALSE)","v":"Minnetonka Public School District"},{"$f":"VLOOKUP(B46,'Page 2 Top'!$A$3:$U$527,20,FALSE)/100","v":2.9965999999999999E-3},{"$f":"VLOOKUP(B46,'Page 2 Bottom'!$A$3:$W$527,20,FALSE)/100","v":0.22769999999999999},0,27.32,27.32,null,120,null,null,12000,null,null,null,{"$f":"VLOOKUP(B46,'Page 1'!$A$3:$O$527,3,FALSE)","v":12061},{"$f":"VLOOKUP(B46,'Page 1'!$A$3:$O$527,9,FALSE)","v":86610313},1.3925593364383753E-4]
[null,{"$f":"'2017 Neighbor Comparison Graph'!B47","v":194},{"$f":"VLOOKUP(B47,Counties!C:F,4,FALSE)","v":"Lakeville Public School District"},{"$f":"VLOOKUP(B47,'Page 2 Top'!$A$3:$U$527,20,FALSE)/100","v":2.5441000000000001E-3},{"$f":"VLOOKUP(B47,'Page 2 Bottom'!$A$3:$W$527,20,FALSE)/100","v":0.32913999999999999},0,39.5,39.5,null,120,null,null,12000,null,null,null,{"$f":"VLOOKUP(B47,'Page 1'!$A$3:$O$527,3,FALSE)","v":1735230},{"$f":"VLOOKUP(B47,'Page 1'!$A$3:$O$527,9,FALSE)","v":67569767},2.5680568056420855E-2]
[null,{"$f":"'2017 Neighbor Comparison Graph'!B48","v":720},{"$f":"VLOOKUP(B48,Counties!C:F,4,FALSE)","v":"Shakopee Public School District"},{"$f":"VLOOKUP(B48,'Page 2 Top'!$A$3:$U$527,20,FALSE)/100","v":1.1477E-3},{"$f":"VLOOKUP(B48,'Page 2 Bottom'!$A$3:$W$527,20,FALSE)/100","v":0.49281999999999998},0,59.14,59.14,null,120,null,null,12000,null,null,null,{"$f":"VLOOKUP(B48,'Page 1'!$A$3:$O$527,3,FALSE)","v":1225349},{"$f":"VLOOKUP(B48,'Page 1'!$A$3:$O$527,9,FALSE)","v":48946987},2.5034206906341346E-2]
[null,{"$f":"'2017 Neighbor Comparison Graph'!B49","v":112},{"$f":"VLOOKUP(B49,Counties!C:F,4,FALSE)","v":"Eastern Carver County Public School"},{"$f":"VLOOKUP(B49,'Page 2 Top'!$A$3:$U$527,20,FALSE)/100","v":2.3814999999999999E-3},{"$f":"VLOOKUP(B49,'Page 2 Bottom'!$A$3:$W$527,20,FALSE)/100","v":0.37006999999999995},0,44.41,44.41,null,120,null,null,12000,null,null,null,{"$f":"VLOOKUP(B49,'Page 1'!$A$3:$O$527,3,FALSE)","v":1665522},{"$f":"VLOOKUP(B49,'Page 1'!$A$3:$O$527,9,FALSE)","v":70429593},2.3648042379003951E-2]
[null,{"$f":"'2017 Neighbor Comparison Graph'!B50","v":0},{"$f":"VLOOKUP(B50,Counties!C:F,4,FALSE)","v":{"$error":"#N/A"}},{"$f":"VLOOKUP(B50,'Page 2 Top'!$A$3:$U$527,20,FALSE)/100","v":{"$error":"#N/A"}},{"$f":"VLOOKUP(B50,'Page 2 Bottom'!$A$3:$W$527,20,FALSE)/100","v":{"$error":"#N/A"}},{"$error":"#N/A"},{"$error":"#N/A"},{"$error":"#N/A"},null,120,null,null,12000,null,null,null,{"$f":"VLOOKUP(B50,'Page 1'!$A$3:$O$527,3,FALSE)","v":{"$error":"#N/A"}},{"$f":"VLOOKUP(B50,'Page 1'!$A$3:$O$527,9,FALSE)","v":{"$error":"#N/A"}},{"$error":"#N/A"}]
[]
[null,"* - School Portion of Property Tax prior to any available Disparity Aid or Taconite Hmstd. Adjustments"]

{"sheet":"Disclosure","index":14,"n_rows":28,"n_cols":1,"rows_kept":28,"cut":false,"hidden":false,"merged":[]}
[]
[]
[{"$f":"'Specific LLC Information'!A3","v":"LLC Updated 10-02-17 Worksheet Update 10-30-17"}]
[]
[]
["Disclosure Information"]
["Robert W. Baird & Co. Incorporated (“Baird”) is not recommending that you take or not take any action. Baird is not acting as financial advisor or municipal advisor to you and does not owe a fiduciary duty pursuant to Section 15B of the Securities Exchange Act of 1934 to you with respect to the information contained herein and/or accompanying materials (collectively, the “Materials”). Baird is acting for its own interests. You should discuss the Materials with any and all internal or external advisors and experts that you deem appropriate before acting on the Materials."]
[]
["Baird seeks to serve as underwriter (or placement agent) in connection with a possible issuance of municipal securities you may be considering and not as financial advisor or municipal advisor. Baird is providing the Materials for discussion purposes only, in anticipation of being engaged to serve as underwriter (or placement agent).  "]
[]
["The role of an underwriter includes the following: Municipal Securities Rulemaking Board Rule G-17 requires an underwriter to deal fairly at all times with both municipal issuers and investors.  An underwriter’s primary role is to purchase the proposed securities to be issued with a view to distribution in an arm’s length commercial transaction with the issuer. An underwriter has financial and other interests that differ from those of the issuer.  An underwriter may provide advice to the issuer concerning the structure, timing, terms, and other similar matters for an issuance of municipal securities. Any such advice, however, would be provided in the context of serving as an underwriter and not as municipal advisor, financial advisor or fiduciary. Unlike a municipal advisor, an underwriter does not have a fiduciary duty to the issuer under the federal securities laws and is therefore not required by federal law to act in the best interests of the issuer without regard to its own financial or other interests.  An underwriter has a duty to purchase securities from the issuer at a fair and reasonable price but must balance that duty with its duty to sell those securities to investors at prices that are fair and reasonable. An underwriter will review the official statement (if any) applicable to the proposed issuance in accordance with, and as part of, its responsibilities to investors under the federal securities laws, as applied to the facts and circumstances of the proposed issuance."]
[]
["The Materials do not include any proposals, recommendations or suggestions that you take or refrain from taking any action with regard to an issuance of municipal securities and are not intended to be and should not be construed as ''advice'' within the meaning of Section 15B of the Securities Exchange Act of 1934 or Rule 15Ba1-1 thereunder. The Materials are intended to provide information of a factual, objective or educational nature, as well as general information about Baird (including its Public Finance unit) and its experience, qualifications and capabilities."]
[]
["Any information or estimates contained in the Materials are based on publicly available data, including information about recent transactions believed to be comparable, and Baird’s experience, and are subject to change without notice.  Baird has not independently verified the accuracy of such data. Interested parties are advised to contact Baird for more information."]
[]
["If you have any questions or concerns about the above disclosures, please contact Baird Public Finance."]
[]
["If you have further questions or need additional information, please do not hesitate to call or email us."]
[]
["Michael R. Hoheisel                                                    Matt Rantapaa"]
["Managing Director                                                        Vice President"]
["Public Finance                                                               Public Finance"]
["Robert W. Baird & Co.                                                  Robert W. Baird & Co."]
[]
["Office Phone - (651)  426-8533 ext 2                           Office Phone - (651)  426-8533 ext 3"]
["Mobile Phone - (651) 260-6451                                    Mobile Phone - (612) 499-6680 "]
["Email: mhoheisel@rwbaird.com                                   Email: mrantapaa@rwbaird.com"]

{"sheet":"Page 1","index":15,"n_rows":528,"n_cols":15,"rows_kept":528,"cut":false,"hidden":true,"merged":[]}
[1,2,3,4,5,6,7,8,9,10,11,12,13,14,15]
[null,null,1,2,3,4,5,6,7,8,9,10,11,19,20]
["dst_num","dst_tye","rls_agc_asd_vlu","rls_nag_asd_vlu","prs_asd_vlu","tax_icr_vlu","trs_adj_vlu","ctr_vlu","mil_dtr_vlu","dis_vlu","tot_tax_vlu","mkt_vlu_2","mil_dtr_vlu_job","mkt_vlu_2_job","dst_act_sts"]
[1.2,3,15230,540831224,9074806,-46716798,0,-62272973,440931489,52548027,493479516,43733641575,0,0,1]
[1,1,2997912,13601700,95396,-164557,-230,-340096,16190125,337465,16527590,761843223,0,0,1]
[2,1,478759,875658,38210,0,-393,0,1392234,0,1392234,73800245,0,0,1]
[4,1,1777501,6666099,38151,-12541,-530,0,8468680,0,8468680,291062031,0,0,1]
[6,3,0,14665644,547530,-1732491,0,-1166149,12314534,3902814,16217348,1394111550,0,0,1]
[11,1,938097,201436068,3321065,-2276641,0,-17137351,186281238,37330578,223611816,19129003568,0,0,1]
[12,1,159401,30664922,440138,-335582,0,-2562669,28366210,4806595,33172805,2880559100,0,0,1]
[13,1,0,19631243,274429,-2080383,0,-2133282,15692007,5770268,21462275,1775647200,0,0,1]
[14,1,0,12977882,244136,-369072,0,-1414203,11438743,2889579,14328322,1154599300,0,0,1]
[15,1,1537125,23849295,596028,-69957,0,-890485,25022006,4668763,29690769,2537745700,0,0,1]
[16,1,0,40185093,1076296,-293661,0,-6130284,34837444,5222127,40059571,3308834800,0,0,1]
[21,1,0,0,0,0,0,0,0,0,0,0,0,0,0]
[22,1,1994621,21890838,185183,-518803,-134,0,23551705,0,23551705,1491284900,0,0,1]
[23,1,1899667,5722188,109011,-68566,-197,0,7662103,0,7662103,453106077,0,0,1]
[24,1,0,0,0,0,0,0,0,0,0,0,0,0,0]
[25,1,0,0,0,0,0,0,0,0,0,0,0,0,1]
[31,1,2769002,26420712,4270468,-305373,0,0,33154809,0,33154809,2484019284,0,0,1]
[32,1,1018485,2038152,25320,-17288,0,0,3064669,0,3064669,183854615,0,0,1]
[36,1,534727,567581,17203,0,0,0,1119511,0,1119511,40570890,0,0,1]
[38,1,0,1985,14062,0,0,0,16047,0,16047,908800,0,0,1]
[47,1,1816103,15622558,414549,-240093,-1238,0,17611879,0,17611879,1508058955,0,0,1]
[51,1,3497422,3413964,222695,-1208,-4655,0,7128218,0,7128218,511907025,0,0,1]
[55,1,0,0,0,0,0,0,0,0,0,0,0,0,0]
[57,1,0,0,0,0,0,0,0,0,0,0,0,0,0]
[58,1,0,0,0,0,0,0,0,0,0,0,0,0,0]
[60,1,0,0,0,0,0,0,0,0,0,0,0,0,0]
[62,1,0,0,0,0,0,0,0,0,0,0,0,0,0]
[70,1,0,0,0,0,0,0,0,0,0,0,0,0,0]
[72,1,0,0,0,0,0,0,0,0,0,0,0,0,0]
[75,1,2478354,1637236,183027,0,0,0,4298617,0,4298617,210449300,0,0,1]
[77,1,3325880,61482633,1617206,-1322099,0,0,65103620,0,65103620,5166583900,0,0,1]
[78,1,0,0,0,0,0,0,0,0,0,0,0,0,0]
[79,1,0,0,0,0,0,0,0,0,0,0,0,0,0]
[81,1,4160060,272050,22516,0,0,0,4454626,0,4454626,43228575,0,0,1]
[84,1,7000166,2234786,92651,-55730,0,0,9271873,0,9271873,274292190,0,0,1]
[85,1,5209520,1270380,66069,-12821,0,0,6533148,0,6533148,145569235,0,0,1]
[88,1,9870102,11978205,179095,-165526,0,0,21861876,0,21861876,1232187840,0,0,1]
[91,1,926782,2091538,103064,0,-1467,0,3119917,0,3119917,218631425,0,0,1]
[93,1,464797,3059605,1166784,-14028,-370,0,4676788,0,4676788,352284145,0,0,1]
[94,1,247278,9186526,966582,-64952,-649,0,10334785,0,10334785,899291080,0,0,1]
[95,1,561943,1344793,155458,-32544,-4925,0,2024725,0,2024725,110255775,0,0,1]
[97,1,728839,3464235,91011,-18704,-2667,0,4262714,0,4262714,273572121,0,0,1]
[99,1,239514,4972226,53324,0,-338,0,5264726,0,5264726,464065548,0,0,1]
[100,1,465270,1540082,1310498,0,0,0,3315850,0,3315850,196593300,0,0,1]
[108,1,2854510,6074859,487517,-139593,0,-610628,8666665,1265745,9932410,665055000,0,0,1]
[110,1,2189162,23061834,559156,-299378,0,-1712803,23797971,2313327,26111298,2223889450,0,0,1]
[111,1,2556216,8120802,315777,0,0,-373177,10619618,1354314,11973932,890008900,0,0,1]
[112,1,1665522,75489578,1334344,-964777,0,-7095074,70429593,5805777,76235370,6818536200,0,0,1]
[113,1,1620067,18029913,253539,-214971,-119,0,19688429,0,19688429,783495775,0,0,1]
[114,1,0,0,0,0,0,0,0,0,0,0,0,0,0]
[115,1,411408,3760030,4399160,-3299,-23201,0,8544098,0,8544098,415880005,0,0,1]
[116,1,1040760,8686725,278587,-21896,0,0,9984176,0,9984176,482760540,0,0,1]
[117,1,0,0,0,0,0,0,0,0,0,0,0,0,0]
[118,1,1384787,13073074,784815,-4908,-1224,0,15236544,0,15236544,469769375,0,0,1]
[119,1,0,0,0,0,0,0,0,0,0,0,0,0,0]
[126,1,0,0,0,0,0,0,0,0,0,0,0,0,0]
[127,1,0,0,0,0,0,0,0,0,0,0,0,0,0]
[128,1,0,0,0,0,0,0,0,0,0,0,0,0,0]
[129,1,4849015,3370831,120943,-15058,0,0,8325731,0,8325731,356180470,0,0,1]
[138,1,2046571,14364395,418609,-360617,-2917,0,16466041,0,16466041,1490713100,0,0,1]
[139,1,957207,3585916,191391,-41228,-2361,0,4690925,0,4690925,381477700,0,0,1]
[140,1,0,0,0,0,0,0,0,0,0,0,0,0,0]
[141,1,0,0,0,0,0,0,0,0,0,0,0,0,0]
[145,1,0,0,0,0,0,0,0,0,0,0,0,0,0]
[146,1,5377646,2402960,646776,-138958,-45778,0,8242646,0,8242646,317140200,0,0,1]
[147,1,0,0,0,0,0,0,0,0,0,0,0,0,0]
[150,1,1879987,3244232,94973,-241222,0,0,4977970,0,4977970,336794100,0,0,1]
[152,1,4634366,35045361,398329,-971266,-8508,0,39098282,0,39098282,3181299900,0,0,1]
[158,1,0,0,0,0,0,0,0,0,0,0,0,0,0]
[161,1,0,0,0,0,0,0,0,0,0,0,0,0,0]
[162,1,1653474,2279897,828676,-53776,0,0,4708271,0,4708271,276058600,0,0,1]
[166,1,1529509,14769197,267245,0,0,-520879,16045072,86631,16131703,630122113,0,0,1]
[173,1,5909774,1058665,169837,-103761,0,0,7034515,0,7034515,128854600,0,0,1]
[175,1,0,0,0,0,0,0,0,0,0,0,0,0,0]
[177,1,6414330,3641252,521975,-472200,0,0,10105357,0,10105357,372002900,0,0,1]
[178,1,0,0,0,0,0,0,0,0,0,0,0,0,0]
[181,1,2890521,53343422,673873,-816195,-495,0,56091126,0,56091126,3753340495,0,0,1]
[182,1,1283336,17889490,324171,-166529,0,-305218,19025250,510549,19535799,941627249,0,0,1]
[186,1,652576,30926184,229149,-59936,0,0,31747973,0,31747973,1264954923,0,0,1]
[191,1,37415,79641686,1326830,-3516222,0,-12379481,65110228,8280802,73391030,6621350810,0,0,1]
[192,1,2369738,26876262,1629262,-197793,0,-1743707,28933762,4618592,33552354,2795558853,0,0,1]
[194,1,1735230,70441968,1528529,-516923,-9677,-5609360,67569767,7006076,74575843,6542908725,0,0,1]
[195,1,2123672,2775639,302200,0,0,-223587,4977924,176444,5154368,304769685,0,0,1]
[196,1,1185200,168946979,3422727,-2471521,0,-15383671,155699714,19311063,175010777,15593078470,0,0,1]
[197,1,17100,69132199,1086942,-1169377,0,-11397427,57669437,5459243,63128680,5507775025,0,0,1]
[199,1,96474,30948126,611907,-1855640,0,-3917829,25883038,3471670,29354708,2719753074,0,0,1]
[200,1,4737094,28284140,837518,-35076,-1995,-2147819,31673862,4713531,36387393,2825969272,0,0,1]
[201,1,0,0,0,0,0,0,0,0,0,0,0,0,0]
[202,1,0,0,0,0,0,0,0,0,0,0,0,0,0]
[203,1,6534761,1965982,487362,-11274,0,0,8976831,0,8976831,275570800,0,0,1]
[204,1,2820694,5880675,201541,-75479,0,0,8827431,0,8827431,666469025,0,0,1]
[205,1,0,0,0,0,0,0,0,0,0,0,0,0,0]
[206,1,3624971,40626378,936620,-1285627,-45165,0,43857177,0,43857177,3017288900,0,0,1]
[207,1,0,0,0,0,0,0,0,0,0,0,0,0,0]
[208,1,0,0,0,0,0,0,0,0,0,0,0,0,0]
[209,1,0,0,0,0,0,0,0,0,0,0,0,0,0]
[213,1,1677911,2657520,381619,-65844,-25984,0,4625222,0,4625222,240562400,0,0,1]
[217,1,0,0,0,0,0,0,0,0,0,0,0,0,0]
[218,1,0,0,0,0,0,0,0,0,0,0,0,0,0]
[219,1,0,0,0,0,0,0,0,0,0,0,0,0,0]
[222,1,0,0,0,0,0,0,0,0,0,0,0,0,0]
[223,1,0,0,0,0,0,0,0,0,0,0,0,0,0]
[224,1,0,0,0,0,0,0,0,0,0,0,0,0,0]
[225,1,0,0,0,0,0,0,0,0,0,0,0,0,0]
[227,1,3859950,2759566,207580,-83734,0,0,6743362,0,6743362,353855325,0,0,1]
[228,1,0,0,0,0,0,0,0,0,0,0,0,0,0]
[229,1,1923781,1000901,57082,-20993,0,0,2960771,0,2960771,115066075,0,0,1]
[232,1,0,0,0,0,0,0,0,0,0,0,0,0,0]
[233,1,0,0,0,0,0,0,0,0,0,0,0,0,0]
[234,1,0,0,0,0,0,0,0,0,0,0,0,0,0]
[236,1,0,0,0,0,0,0,0,0,0,0,0,0,0]
[237,1,0,0,0,0,0,0,0,0,0,0,0,0,0]
[238,1,2655987,701750,158190,-4077,0,0,3511850,0,3511850,98397715,0,0,1]
[239,1,3045970,2019369,119839,-10418,0,0,5174760,0,5174760,238443725,0,0,1]
[240,1,0,0,0,0,0,0,0,0,0,0,0,0,0]
[241,1,5693136,12489835,1559258,-276169,0,0,19466060,0,19466060,1279243040,0,0,1]
[242,1,2791773,478576,131468,-13232,0,0,3388585,0,3388585,79021565,0,0,1]
[243,1,0,0,0,0,0,0,0,0,0,0,0,0,0]
[244,1,0,0,0,0,0,0,0,0,0,0,0,0,0]
[245,1,0,0,0,0,0,0,0,0,0,0,0,0,0]
[252,1,3352473,6641559,382684,0,-25465,-21536,10329715,9681,10339396,721960700,0,0,1]
[253,1,3206113,1475509,60247,-55033,0,0,4686836,0,4686836,203469250,0,0,1]
[254,1,0,0,0,0,0,0,0,0,0,0,0,0,0]
[255,1,2513748,4455755,735293,-42823,-23374,0,7638599,0,7638599,546214700,0,0,1]
[256,1,2787600,33544888,566171,-101060,0,0,36797599,0,36797599,2438457700,0,0,1]
[258,1,0,0,0,0,0,0,0,0,0,0,0,0,0]
[260,1,0,0,0,0,0,0,0,0,0,0,0,0,0]
[261,1,1124491,1082987,263322,-9919,-23246,0,2437635,0,2437635,100511500,0,0,1]
[262,1,0,0,0,0,0,0,0,0,0,0,0,0,0]
[263,1,0,0,0,0,0,0,0,0,0,0,0,0,0]
[264,1,4575548,346178,217346,0,-5345,0,5133727,0,5133727,52608200,0,0,1]
[265,1,0,0,0,0,0,0,0,0,0,0,0,0,0]
[270,1,0,132941977,1170835,-4922164,0,-21492472,107698176,6438546,114136722,10221031275,0,0,1]
[271,1,3655,158717809,1449016,-12708652,0,-21724062,125737766,8433402,134171168,11851068700,0,0,1]
[272,1,44200,112695904,1813017,-3209405,0,-15274019,96069697,4903173,100972870,9255347675,0,0,1]
[273,1,0,106144123,434354,-1837358,0,-7725787,97015332,2539122,99554454,8997851250,0,0,1]
[276,1,12061,88690042,651305,-106294,0,-2636801,86610313,2870275,89480588,7797460600,0,0,1]
[277,1,213923,37316809,428391,-650684,0,-757398,36551041,1437650,37988691,3333355750,0,0,1]
[278,1,675974,38093922,347527,-160004,0,-1239845,37717574,840335,38557909,3182404550,0,0,1]
[279,1,923629,169619505,2686218,-3216834,-5094,-22001896,148005528,19576883,167582411,14521359705,0,0,1]
[280,1,0,53381745,495368,-5498277,0,-8342402,40036434,6063378,46099812,4236913179,0,0,1]
[281,1,444,94470567,1430075,-2804981,0,-9078698,84017407,15883569,99900976,8497124725,0,0,1]
[282,1,0,11172693,187652,-1303995,0,-689985,9366365,1440971,10807336,1021079100,0,0,1]
[283,1,0,73099263,608494,-8211886,0,-8334158,57161713,4839060,62000773,6028721350,0,0,1]
[284,1,270129,151013068,1798257,-3919143,0,-18138351,131023960,6041163,137065123,12122349125,0,0,1]
[286,1,0,7595371,146093,-1204717,0,-1331651,5205096,2052852,7257948,599403133,0,0,1]
[287,6,0,0,0,0,0,0,0,0,0,0,0,0,0]
[288,6,0,0,0,0,0,0,0,0,0,0,0,0,0]
[294,1,1928528,1187553,98901,-8312,0,0,3206670,0,3206670,161120010,0,0,1]
[297,1,1614144,762659,54294,-24302,0,0,2406795,0,2406795,104678725,0,0,1]
[299,1,2887840,2789780,54058,-15145,0,0,5716533,0,5716533,331027700,0,0,1]
[300,1,893951,6195340,174307,-60566,0,0,7203032,0,7203032,648093450,0,0,1]
[301,1,0,0,0,0,0,0,0,0,0,0,0,0,0]
[306,1,418264,2111994,19295,0,0,0,2549553,0,2549553,119288000,0,0,1]
[308,1,560514,5371600,50590,0,-368,0,5982336,0,5982336,236594150,0,0,1]
[309,1,3145593,16845795,1192537,-164437,-386,0,21019102,0,21019102,1042755065,0,0,1]
[314,1,1383710,2705052,44412,-40791,0,0,4092383,0,4092383,335609270,0,0,1]
[316,1,881602,4981664,1445326,-202194,-18179,-679382,6408837,624592,7033429,544150586,0,0,1]
[317,1,1024058,6176059,1170144,-5776,-6180,0,8358305,0,8358305,421638851,0,0,1]
[318,1,5139544,36072214,4983244,-328674,-20244,-3591608,42254476,1203026,43457502,2760698083,0,0,1]
[319,1,866908,2507547,195161,0,-1739,-99100,3468777,334415,3803192,213115283,0,0,1]
[323,2,67876,233077,0,0,0,0,300953,0,300953,26732900,0,0,1]
[324,1,0,0,0,0,0,0,0,0,0,0,0,0,0]
[325,1,0,0,0,0,0,0,0,0,0,0,0,0,0]
[328,1,0,0,0,0,0,0,0,0,0,0,0,0,0]
[330,1,5187300,737969,547120,0,0,0,6472389,0,6472389,109303800,0,0,1]
[332,1,1919039,5210501,39686,-77805,0,0,7091421,0,7091421,555615575,0,0,1]
[333,1,946743,1193472,27759,-3224,0,0,2164750,0,2164750,154609170,0,0,1]
[341,1,0,0,0,0,0,0,0,0,0,0,0,0,0]
[345,1,1693141,12124035,139401,-98159,-103,0,13858315,0,13858315,892767800,0,0,1]
[346,1,0,0,0,0,0,0,0,0,0,0,0,0,0]
[347,1,5480261,17537275,683910,-43820,-2801,0,23654825,0,23654825,1578900100,0,0,1]
[351,1,0,0,0,0,0,0,0,0,0,0,0,0,0]
[352,1,0,0,0,0,0,0,0,0,0,0,0,0,0]
[353,1,0,0,0,0,0,0,0,0,0,0,0,0,0]
[354,1,0,0,0,0,0,0,0,0,0,0,0,0,0]
[356,1,1026373,193087,101430,0,0,0,1320890,0,1320890,27525095,0,0,1]
[361,1,731433,6630968,128366,0,0,0,7490767,0,7490767,533280853,0,0,1]
[362,1,707892,538009,104059,0,0,0,1349960,0,1349960,62005965,0,0,1]
[363,1,1054570,545352,30527,0,0,0,1630449,0,1630449,48008220,0,0,1]
[371,1,0,0,0,0,0,0,0,0,0,0,0,0,0]
[376,1,0,0,0,0,0,0,0,0,0,0,0,0,0]
[377,1,0,0,0,0,0,0,0,0,0,0,0,0,0]
[378,1,6343413,982153,147696,-4917,0,0,7468345,0,7468345,125113635,0,0,1]
[381,1,3322173,18461348,272920,0,0,-908924,21147517,619585,21767102,1208570103,0,0,1]
[390,1,1223107,3467561,168745,-25726,-14595,0,4819092,0,4819092,240320700,0,0,1]
[391,1,1806468,3080323,72661,0,0,0,4959452,0,4959452,251468800,0,0,1]
[392,1,0,0,0,0,0,0,0,0,0,0,0,0,0]
[393,1,0,0,0,0,0,0,0,0,0,0,0,0,0]
[394,1,0,0,0,0,0,0,0,0,0,0,0,0,0]
[395,1,0,0,0,0,0,0,0,0,0,0,0,0,0]
[402,1,2179130,476756,296966,-39399,-15693,0,2897760,0,2897760,63486200,0,0,1]
[403,1,3626244,324487,369176,0,-15275,0,4304632,0,4304632,65905100,0,0,1]
[404,1,4158041,653387,532295,-20470,0,0,5323253,0,5323253,88336000,0,0,1]
[408,1,0,0,0,0,0,0,0,0,0,0,0,0,0]
[409,1,0,0,0,0,0,0,0,0,0,0,0,0,0]
[411,1,0,0,0,0,0,0,0,0,0,0,0,0,0]
[412,1,0,0,0,0,0,0,0,0,0,0,0,0,0]
[413,1,5528849,13095893,617478,-681522,-27756,0,18532942,0,18532942,1095047400,0,0,1]
[414,1,5190663,840676,292314,-38030,-19147,0,6266476,0,6266476,131471700,0,0,1]
[415,1,2075964,514889,53980,0,0,0,2644833,0,2644833,67411400,0,0,1]
[417,1,0,0,0,0,0,0,0,0,0,0,0,0,0]
[418,1,0,0,0,0,0,0,0,0,0,0,0,0,0]
[421,1,0,0,0,0,0,0,0,0,0,0,0,0,0]
[422,1,0,0,0,0,0,0,0,0,0,0,0,0,0]
[423,1,4064397,12737615,74732,-197376,0,0,16679368,0,16679368,1229923250,0,0,1]
[424,1,1080588,1562109,90923,0,0,-78,2733542,46,2733588,191747900,0,0,1]
[425,1,0,0,0,0,0,0,0,0,0,0,0,0,0]
[426,1,0,0,0,0,0,0,0,0,0,0,0,0,0]
[427,1,0,0,0,0,0,0,0,0,0,0,0,0,0]
[432,1,2435199,986684,81666,-6133,0,0,3497416,0,3497416,99708200,0,0,1]
[435,1,2416037,2977117,26826,0,0,0,5419980,0,5419980,145335900,0,0,1]
[436,1,0,0,0,0,0,0,0,0,0,0,0,0,0]
[437,1,0,0,0,0,0,0,0,0,0,0,0,0,0]
[440,1,0,0,0,0,0,0,0,0,0,0,0,0,0]
[441,1,1893061,1534708,1252993,0,0,0,4680762,0,4680762,193120300,0,0,1]
[442,1,0,0,0,0,0,0,0,0,0,0,0,0,0]
[443,1,0,0,0,0,0,0,0,0,0,0,0,0,0]
[444,1,0,0,0,0,0,0,0,0,0,0,0,0,0]
[446,1,0,0,0,0,0,0,0,0,0,0,0,0,0]
[447,1,1425873,256707,10219,0,0,0,1692799,0,1692799,32816500,0,0,1]
[451,1,0,0,0,0,0,0,0,0,0,0,0,0,0]
[453,1,0,0,0,0,0,0,0,0,0,0,0,0,0]
[454,1,0,0,0,0,0,0,0,0,0,0,0,0,0]
[456,1,0,0,0,0,0,0,0,0,0,0,0,0,0]
[457,1,0,0,0,0,0,0,0,0,0,0,0,0,0]
[458,1,5606393,697695,105116,0,0,0,6409204,0,6409204,99038810,0,0,1]
[459,1,0,0,0,0,0,0,0,0,0,0,0,0,0]
[460,1,0,0,0,0,0,0,0,0,0,0,0,0,0]
[461,1,0,0,0,0,0,0,0,0,0,0,0,0,0]
[463,1,1785001,3208000,284658,-10401,0,0,5267258,0,5267258,289863700,0,0,1]
[464,1,0,0,0,0,0,0,0,0,0,0,0,0,0]
[465,1,4173831,7696631,423630,0,-5467,0,12288625,0,12288625,747244800,0,0,1]
[466,1,3325787,6680672,497309,-67625,-5926,0,10430217,0,10430217,683425225,0,0,1]
[473,1,829547,4174944,51917,-27896,0,0,5028512,0,5028512,250216775,0,0,1]
[477,1,2191112,12644740,459671,-99718,0,0,15195805,0,15195805,1352207100,0,0,1]
[480,1,1235784,5428740,93737,-1746,0,0,6756515,0,6756515,296554700,0,0,1]
[482,1,3330735,8841417,781449,-175765,0,0,12777836,0,12777836,978323800,0,0,1]
[483,1,0,0,0,0,0,0,0,0,0,0,0,0,0]
[484,1,2197804,2392918,188084,-76174,0,0,4702632,0,4702632,282152900,0,0,1]
[485,1,1391386,2058846,105027,-32483,0,0,3522776,0,3522776,236924100,0,0,1]
[486,1,869602,988738,301401,0,0,0,2159741,0,2159741,107498700,0,0,1]
[487,1,864022,683693,171634,-5119,0,0,1714230,0,1714230,107451100,0,0,1]
[492,1,3757277,12935947,490689,-175408,0,0,17008505,0,17008505,1327796595,0,0,1]
[495,1,3603531,795143,69803,-28981,0,0,4439496,0,4439496,101116600,0,0,1]
[497,1,1930725,388662,78432,-12391,0,0,2385428,0,2385428,55893500,0,0,1]
[499,1,4030293,737253,91246,0,0,0,4858792,0,4858792,98706200,0,0,1]
[500,1,6857046,1337574,307197,0,0,0,8501817,0,8501817,183826300,0,0,1]
[504,1,0,0,0,0,0,0,0,0,0,0,0,0,0]
[505,1,7289492,642592,93932,-994,0,0,8025022,0,8025022,98802600,0,0,1]
[507,1,4676486,1361116,165143,-5396,0,0,6197349,0,6197349,183370700,0,0,1]
[508,1,3585545,8476835,403692,-644224,0,0,11821848,0,11821848,857236480,0,0,1]
[511,1,6445872,787236,322594,0,0,0,7555702,0,7555702,124988500,0,0,1]
[513,1,0,0,0,0,0,0,0,0,0,0,0,0,0]
[514,1,3367535,164475,13171,0,0,0,3545181,0,3545181,31577500,0,0,1]
[516,1,0,0,0,0,0,0,0,0,0,0,0,0,0]
[518,1,9587869,8875047,753373,-189159,0,0,19027130,0,19027130,851087800,0,0,1]
[521,1,0,0,0,0,0,0,0,0,0,0,0,0,0]
[522,1,0,0,0,0,0,0,0,0,0,0,0,0,0]
[523,1,0,0,0,0,0,0,0,0,0,0,0,0,0]
[524,1,0,0,0,0,0,0,0,0,0,0,0,0,0]
[525,1,0,0,0,0,0,0,0,0,0,0,0,0,0]
[526,1,0,0,0,0,0,0,0,0,0,0,0,0,0]
[531,1,2046127,6825198,279308,-69221,0,0,9081412,0,9081412,726341500,0,0,1]
[533,1,2939509,2370174,99180,0,0,0,5408863,0,5408863,294391600,0,0,1]
[534,1,4021574,5917645,674130,-31384,0,0,10581965,0,10581965,656869900,0,0,1]
[535,1,4559616,138390502,1490325,-1941810,0,0,142498633,0,142498633,11883198000,0,0,1]
[542,1,1653853,11085509,33394,-43920,0,0,12728836,0,12728836,475443525,0,0,1]
[543,1,0,0,0,0,0,0,0,0,0,0,0,0,0]
[544,1,4481582,14560156,1117303,-117849,-60775,0,19980417,0,19980417,1356374775,277996,13925200,1]
[545,1,1328194,3182204,33431,-7075,-21,0,4536733,0,4536733,203657290,0,0,1]
[547,1,1767413,2059951,84963,0,0,0,3912327,0,3912327,184232500,0,0,1]
[548,1,2857122,13835856,109001,-4612,-1034,0,16796333,0,16796333,599591742,0,0,1]
[549,1,2467378,17326259,280935,-759037,0,0,19315535,0,19315535,1053712575,0,0,1]
[550,1,1195108,2120693,46768,0,0,0,3362569,0,3362569,172980370,0,0,1]
[553,1,1453975,1817064,60589,-84040,0,0,3247588,0,3247588,189819710,0,0,1]
[561,1,1924485,139386,3153,0,0,0,2067024,0,2067024,31383500,0,0,1]
[564,1,3879613,6897027,2527861,-227957,0,0,13076544,0,13076544,849737100,0,0,1]
[566,1,0,0,0,0,0,0,0,0,0,0,0,0,0]
[570,1,0,0,0,0,0,0,0,0,0,0,0,0,0]
[573,1,0,0,0,0,0,0,0,0,0,0,0,0,0]
[576,1,0,0,0,0,0,0,0,0,0,0,0,0,0]
[577,1,986291,2266180,118771,0,-3392,0,3367850,0,3367850,183849595,0,0,1]
[578,1,1431426,6998522,221956,-55433,-2809,0,8593662,0,8593662,629764730,0,0,1]
[581,1,4211907,824322,31837,0,0,0,5068066,0,5068066,111961600,0,0,1]
[582,1,0,0,0,0,0,0,0,0,0,0,0,0,0]
[583,1,0,0,0,0,0,0,0,0,0,0,0,0,0]
[584,1,0,0,0,0,0,0,0,0,0,0,0,0,0]
[592,1,3006012,178533,8215,0,0,0,3192760,0,3192760,27365200,0,0,1]
[593,1,6749568,4344380,245017,-43632,0,0,11295333,0,11295333,445236700,0,0,1]
[595,1,4724468,7868264,101809,0,0,0,12694541,0,12694541,746088100,0,0,1]
[597,1,0,0,0,0,0,0,0,0,0,0,0,0,0]
[599,1,2943647,2240428,55743,-4593,-106,0,5235119,0,5235119,161211800,0,0,1]
[600,1,3915811,445230,51521,-3537,0,0,4409025,0,4409025,59002100,0,0,1]
[601,1,1952253,1564883,396422,-80629,0,0,3832929,0,3832929,178474900,0,0,1]
[603,1,0,0,0,0,0,0,0,0,0,0,0,0,0]
[604,1,0,0,0,0,0,0,0,0,0,0,0,0,0]
[611,1,0,0,0,0,0,0,0,0,0,0,0,0,0]
[612,1,0,0,0,0,0,0,0,0,0,0,0,0,0]
[614,1,0,0,0,0,0,0,0,0,0,0,0,0,0]
[615,1,0,0,0,0,0,0,0,0,0,0,0,0,0]
[621,1,55245,103760343,1383343,-6424566,0,-12908522,85865843,10010150,95875993,8752524300,0,0,1]
[622,1,285764,88860008,1246996,-2421303,0,-13134465,74837000,13170723,88007723,7463934900,0,0,1]
[623,1,2716,67191992,972678,-1430888,0,-7954475,58782023,7349115,66131138,5705909900,0,0,1]
[624,1,422640,76741560,1281958,-1266217,0,-7795352,69384589,7815144,77199733,6904085300,0,0,1]
[625,1,2714,251084061,7042614,-20845546,0,-25323950,211959893,55452568,267412461,21803246000,0,0,1]
[627,1,0,0,0,0,0,0,0,0,0,0,0,0,0]
[628,1,0,0,0,0,0,0,0,0,0,0,0,0,0]
[630,1,1429784,612439,29655,-11471,0,0,2060407,0,2060407,86896600,0,0,1]
[631,1,0,0,0,0,0,0,0,0,0,0,0,0,0]
[633,1,0,0,0,0,0,0,0,0,0,0,0,0,0]
[635,1,2919581,184112,166186,0,-15054,0,3254825,0,3254825,40198100,0,0,1]
[636,1,0,0,0,0,0,0,0,0,0,0,0,0,0]
[637,1,0,0,0,0,0,0,0,0,0,0,0,0,0]
[638,1,0,0,0,0,0,0,0,0,0,0,0,0,0]
[640,1,6953408,738106,411098,-21894,-34922,0,8045796,0,8045796,121586100,0,0,1]
[641,1,0,0,0,0,0,0,0,0,0,0,0,0,0]
[646,1,0,0,0,0,0,0,0,0,0,0,0,0,0]
[647,1,0,0,0,0,0,0,0,0,0,0,0,0,0]
[648,1,0,0,0,0,0,0,0,0,0,0,0,0,0]
[649,1,0,0,0,0,0,0,0,0,0,0,0,0,0]
[650,1,0,0,0,0,0,0,0,0,0,0,0,0,0]
[651,1,0,0,0,0,0,0,0,0,0,0,0,0,0]
[652,1,0,0,0,0,0,0,0,0,0,0,0,0,0]
[653,1,0,0,0,0,0,0,0,0,0,0,0,0,0]
[654,1,0,0,0,0,0,0,0,0,0,0,0,0,0]
[655,1,0,0,0,0,0,0,0,0,0,0,0,0,0]
[656,1,4954135,20174970,1306948,-206069,0,0,26229984,0,26229984,1950282800,291438,14609400,1]
[657,1,0,0,0,0,0,0,0,0,0,0,0,0,0]
[659,1,4521700,21770025,830495,-641420,0,-182315,26298485,86860,26385345,2155124320,0,0,1]
[669,1,0,0,0,0,0,0,0,0,0,0,0,0,0]
[670,1,0,0,0,0,0,0,0,0,0,0,0,0,0]
[671,1,6375648,740097,46017,-2193,0,0,7159569,0,7159569,99682400,0,0,1]
[676,1,680207,234632,7586,0,0,0,922425,0,922425,39246300,0,0,1]
[678,1,0,0,0,0,0,0,0,0,0,0,0,0,0]
[682,1,2353288,3187405,60134,-33288,-228,0,5567311,0,5567311,373288600,0,0,1]
[690,1,826430,3848538,152018,-22983,-8133,0,4795870,0,4795870,319551100,0,0,1]
[691,1,0,0,0,0,0,0,0,0,0,0,0,0,0]
[692,1,0,0,0,0,0,0,0,0,0,0,0,0,0]
[693,1,0,0,0,0,0,0,0,0,0,0,0,0,0]
[695,1,143269,1676010,98713,-6891,-2059,-59213,1849829,-891813,958016,197210265,0,0,1]
[696,1,624086,5830915,34495,-58743,0,-215013,6215740,370205,6585945,373623050,0,0,1]
[697,1,0,0,0,0,0,0,0,0,0,0,0,0,0]
[698,1,553187,1855566,2716936,0,-10519,0,5115170,0,5115170,255920240,0,0,1]
[699,1,0,0,0,0,0,0,0,0,0,0,0,0,0]
[700,1,423796,13688712,828294,-31432,-3569,0,14905801,0,14905801,1191863859,0,0,1]
[701,1,609173,8813314,622931,-106561,-8828,-631193,9298836,1596108,10894944,861317236,0,0,1]
[704,1,511858,10022947,525846,0,-34402,0,11026249,0,11026249,983556536,0,0,1]
[706,1,225962,5020881,500101,-8,0,-583331,5163605,1033347,6196952,506678647,0,0,1]
[707,1,106438,1505,181,0,0,0,108124,0,108124,99200,0,0,1]
[708,1,0,0,0,0,0,0,0,0,0,0,0,0,0]
[709,1,649710,74649970,2525298,-1907276,-15735,0,75901967,0,75901967,6746712710,0,0,1]
[710,1,0,0,0,0,0,0,0,0,0,0,0,0,0]
[712,1,252401,3541400,242206,-80902,-3435,-477267,3474403,365796,3840199,291986960,0,0,1]
[716,1,2914700,6778640,798819,0,-38739,-635106,9818314,1362992,11181306,750830800,0,0,1]
[717,1,1695776,9713108,219308,-141512,0,-862991,10623689,1424743,12048432,941505500,0,0,1]
[719,1,601261,51010882,591587,-496771,0,-2098655,49608304,4674702,54283006,4920507700,0,0,1]
[720,1,1225349,55003162,776727,-827765,0,-7230486,48946987,5983205,54930192,4606879600,0,0,1]
[721,1,4039215,17354965,1222388,-60847,-47006,-489471,22019244,705730,22724974,1844869400,0,0,1]
[726,1,1166340,22194106,340199,0,-5582,0,23695063,0,23695063,1563023476,0,0,1]
[727,1,310753,13083587,237352,-98363,0,0,13533329,0,13533329,1306407086,0,0,1]
[728,1,1800778,74265738,1428235,-639253,0,-4770812,72084686,1849202,73933888,6626384872,0,0,1]
[731,1,0,0,0,0,0,0,0,0,0,0,0,0,0]
[732,1,0,0,0,0,0,0,0,0,0,0,0,0,0]
[733,1,0,0,0,0,0,0,0,0,0,0,0,0,0]
[734,1,0,0,0,0,0,0,0,0,0,0,0,0,0]
[735,1,0,0,0,0,0,0,0,0,0,0,0,0,0]
[736,1,0,0,0,0,0,0,0,0,0,0,0,0,0]
[737,1,0,0,0,0,0,0,0,0,0,0,0,0,0]
[738,1,1885381,2401118,18037,-39640,0,0,4264896,0,4264896,315406700,0,0,1]
[739,1,1913787,3211802,86221,-1295,0,0,5210515,0,5210515,321071800,0,0,1]
[740,1,3601380,5166649,829857,-129949,-68421,0,9399516,0,9399516,547052700,0,0,1]
[741,1,2753306,5015208,407443,-127077,-6615,0,8042265,0,8042265,430731300,0,0,1]
[742,1,2865250,73797666,2156290,-980614,-65086,0,77773506,0,77773506,6266616000,0,0,1]
[743,1,3238039,5607645,700067,-29818,-53075,0,9462858,0,9462858,547469500,0,0,1]
[745,1,2380270,6084194,882003,-218516,-33081,0,9094870,0,9094870,678383000,0,0,1]
[748,1,610427,14796156,209777,-101145,0,0,15515215,0,15515215,1415982000,0,0,1]
[750,1,1685798,11615512,602790,-261354,-27896,0,13614850,0,13614850,1051468400,0,0,1]
[756,1,5567091,1719921,94439,-10896,0,0,7370555,0,7370555,227791100,0,0,1]
[761,1,6621307,21341690,587922,-511589,0,0,28039330,0,28039330,2033093200,0,0,1]
[762,1,0,0,0,0,0,0,0,0,0,0,0,0,0]
[763,1,2142153,1982393,127809,0,0,0,4252355,0,4252355,222364900,0,0,1]
[768,1,2674490,410302,124452,0,0,0,3209244,0,3209244,57681200,0,0,1]
[769,1,0,0,0,0,0,0,0,0,0,0,0,0,0]
[771,1,6071363,388206,256950,0,0,0,6716519,0,6716519,60175200,0,0,1]
[775,1,7188091,984072,273517,-3158,0,0,8442522,0,8442522,138441600,0,0,1]
[777,1,9872174,3388495,465856,-68380,0,0,13658145,0,13658145,336697200,0,0,1]
[784,1,0,0,0,0,0,0,0,0,0,0,0,0,0]
[786,1,1037809,357117,20888,0,0,0,1415814,0,1415814,67037700,0,0,1]
[787,1,911696,912514,25011,0,0,0,1849221,0,1849221,93989200,0,0,1]
[789,1,0,0,0,0,0,0,0,0,0,0,0,0,0]
[790,1,0,0,0,0,0,0,0,0,0,0,0,0,0]
[791,1,0,0,0,0,0,0,0,0,0,0,0,0,0]
[792,1,0,0,0,0,0,0,0,0,0,0,0,0,0]
[793,1,0,0,0,0,0,0,0,0,0,0,0,0,0]
[801,1,982081,436819,8420,0,0,0,1427320,0,1427320,20459800,0,0,1]
[803,1,7416885,711996,341336,0,-2431,0,8467786,0,8467786,95861100,0,0,1]
[806,1,0,0,0,0,0,0,0,0,0,0,0,0,0]
[809,1,0,0,0,0,0,0,0,0,0,0,0,0,0]
[810,1,0,0,0,0,0,0,0,0,0,0,0,0,0]
[811,1,1717887,4669008,274475,-100094,-16958,0,6544318,0,6544318,449509000,0,0,1]
[813,1,3825709,7267928,289073,-41055,0,0,11341655,0,11341655,727305675,0,0,1]
[815,2,1087327,344635,43958,0,0,0,1475920,0,1475920,42847600,0,0,1]
[818,1,736374,490189,217607,0,0,0,1444170,0,1444170,78770700,0,0,1]
[819,1,0,0,0,0,0,0,0,0,0,0,0,0,0]
[820,1,1541569,718417,309411,-11400,0,0,2557997,0,2557997,122868400,0,0,1]
[821,1,1252248,1679158,305111,-10227,-393,0,3225897,0,3225897,184671900,0,0,1]
[827,1,0,0,0,0,0,0,0,0,0,0,0,0,0]
[829,1,4400971,6686226,386686,-54498,0,0,11419385,0,11419385,703890975,0,0,1]
[830,1,0,0,0,0,0,0,0,0,0,0,0,0,0]
[831,1,2010419,49185814,988193,-315768,-395,-3216864,48651399,5264712,53916111,4672890900,0,0,1]
[832,1,371984,21895259,329661,0,-220,-705658,21891026,1355452,23246478,2076242300,0,0,1]
[833,1,1598306,101040232,1995934,-858726,0,-6595331,97180415,12705153,109885568,9652063700,0,0,1]
[834,1,2593669,94444653,1330186,-1603583,-270,-7588432,89176223,6408262,95584485,8487566000,0,0,1]
[836,1,3299015,303232,30721,0,0,0,3632968,0,3632968,42909835,0,0,1]
[837,1,4640146,1341411,90204,-6901,0,0,6064860,0,6064860,159202275,0,0,1]
[840,1,7303235,2193267,111173,-55397,0,0,9552278,0,9552278,251548745,0,0,1]
[846,1,7280615,2341228,58304,-10195,0,0,9669952,0,9669952,255582800,0,0,1]
[850,1,2629968,332983,383274,0,-16190,0,3330035,0,3330035,68720195,0,0,1]
[852,1,6580157,349239,151805,0,-4084,0,7077117,0,7077117,42387100,0,0,1]
[857,1,3716340,1822731,141294,0,0,0,5680365,0,5680365,245270775,0,0,1]
[858,1,3054158,3217094,93130,-82730,0,0,6281652,0,6281652,372261700,0,0,1]
[861,1,3557600,26324942,655535,-108229,0,0,30429848,0,30429848,2492033890,0,0,1]
[876,1,1921116,13888729,159804,-16131,-825,0,15952693,0,15952693,961473900,0,0,1]
[877,1,3156512,27954307,574804,-82869,-8646,-126764,31467344,390799,31858143,2769884575,0,0,1]
[879,1,1701082,13169886,291274,-153773,0,-326698,14681771,242997,14924768,1276402200,0,0,1]
[880,1,0,0,0,0,0,0,0,0,0,0,0,0,0]
[881,1,1193750,4438927,156655,0,-1116,0,5788216,0,5788216,421657700,0,0,1]
[882,1,1631828,34628538,654158,-722414,-19687,0,36172423,0,36172423,2531722575,0,0,1]
[883,1,851056,9771912,636524,-50236,-1920,-709904,10497432,425244,10922676,943268525,0,0,1]
[885,1,808294,19141446,387292,-281979,-1589,0,20053464,0,20053464,1901580825,0,0,1]
[891,1,6869375,1125769,112278,-101960,0,0,8005462,0,8005462,152389995,0,0,1]
[892,1,0,0,0,0,0,0,0,0,0,0,0,0,0]
[893,1,0,0,0,0,0,0,0,0,0,0,0,0,0]
[894,1,0,0,0,0,0,0,0,0,0,0,0,0,0]
[896,1,0,0,0,0,0,0,0,0,0,0,0,0,0]
[911,1,2870229,18358382,511504,-207346,0,0,21532769,0,21532769,1933863000,0,0,1]
[912,1,2304319,4837222,134321,-48173,-1580,0,7226109,0,7226109,602108100,0,0,1]
[913,1,0,0,0,0,0,0,0,0,0,0,0,0,0]
[914,1,3098097,689219,78414,-5065,0,0,3860665,0,3860665,87877500,0,0,1]
[916,6,0,0,0,0,0,0,0,0,0,0,0,0,0]
[917,6,0,0,0,0,0,0,0,0,0,0,0,0,0]
[918,1,0,0,0,0,0,0,0,0,0,0,0,0,0]
[2071,1,7395739,4055466,325569,-199855,0,0,11576919,0,11576919,460772800,0,0,1]
[2125,1,7469749,3322670,207984,-12649,0,0,10987754,0,10987754,386115755,0,0,1]
[2134,1,11233626,1800020,384737,-6928,0,0,13411455,0,13411455,266855840,0,0,1]
[2135,1,10017906,2302395,131700,0,0,0,12452001,0,12452001,314868200,0,0,1]
[2137,1,4448682,2218808,136344,-39083,0,0,6764751,0,6764751,281523835,0,0,1]
[2142,1,5363529,24239375,2267609,-17624,-20756,-1211683,30620450,783637,31404087,1459510945,0,0,1]
[2143,1,3340303,5344786,212474,-20063,0,0,8877500,0,8877500,485306075,0,0,1]
[2144,1,2179417,18297428,570871,-54769,-597,-20002,20972348,46087,21018435,1897527000,0,0,1]
[2148,1,0,0,0,0,0,0,0,0,0,0,0,0,0]
[2149,1,6592551,8621867,401539,-195466,-11027,0,15409464,0,15409464,705664800,0,0,1]
[2153,1,0,0,0,0,0,0,0,0,0,0,0,0,0]
[2154,1,305982,3888944,272811,0,0,-238128,4229609,937994,5167603,412581050,0,0,1]
[2155,1,1476008,3007396,95672,-41734,-118,0,4537224,0,4537224,338913440,0,0,1]
[2159,1,11207288,1584006,433959,0,0,0,13225253,0,13225253,218691600,0,0,1]
[2163,1,0,0,0,0,0,0,0,0,0,0,0,0,0]
[2164,1,5720205,3745993,180376,-125856,-155,0,9520563,0,9520563,399154200,0,0,1]
[2165,1,2039726,4902233,181186,0,-4596,0,7118549,0,7118549,402890445,0,0,1]
[2167,1,6124670,1264186,528940,-16813,-40436,0,7860547,0,7860547,170218900,0,0,1]
[2168,1,7601182,2431953,640487,-15886,0,0,10657736,0,10657736,313208980,0,0,1]
[2169,1,9287568,2245388,472465,-18170,0,0,11987251,0,11987251,246306700,0,0,1]
[2170,1,2667215,6182775,664719,-17764,-253,0,9496692,0,9496692,512399320,0,0,1]
[2171,1,5464754,2506968,1883367,-8770,0,0,9846319,0,9846319,264568800,0,0,1]
[2172,1,6604339,2874564,180152,-114574,-10240,0,9534241,0,9534241,378091475,0,0,1]
[2174,1,2329172,11528491,298682,-21865,-1936,0,14132544,0,14132544,562225448,0,0,1]
[2176,1,8913249,1402128,445477,-26591,0,0,10734263,0,10734263,184541000,0,0,1]
[2180,1,11197619,1789479,558670,-12167,0,0,13533601,0,13533601,237454136,0,0,1]
[2183,1,0,0,0,0,0,0,0,0,0,0,0,0,0]
[2184,1,11689877,3545606,206054,-63300,0,0,15378237,0,15378237,379165900,0,0,1]
[2190,1,12554646,3418017,562826,-92849,-22934,0,16419706,0,16419706,372501690,0,0,1]
[2198,1,5000227,2249341,256862,-65148,0,0,7441282,0,7441282,274766060,0,0,1]
[2215,1,2628998,426046,59276,0,-367,0,3113953,0,3113953,74143400,0,0,1]
[2310,1,8375661,2990906,648703,-58599,-49388,0,11907283,0,11907283,420307290,0,0,1]
[2311,1,1616195,4058297,2795971,0,0,0,8470463,0,8470463,406184000,0,0,1]
[2342,1,9113523,2420847,255582,-4487,-11393,0,11774072,0,11774072,268357900,0,0,1]
[2358,1,1806808,588449,233167,0,0,0,2628424,0,2628424,76527930,0,0,1]
[2359,1,0,0,0,0,0,0,0,0,0,0,0,0,0]
[2364,1,4725478,2104686,197048,-20014,-3190,0,7004008,0,7004008,231742900,0,0,1]
[2365,1,13645247,1996308,1046216,-23806,-66017,0,16597948,0,16597948,322259750,0,0,1]
[2396,1,9034734,4153827,217638,0,-2453,0,13403746,0,13403746,350376200,0,0,1]
[2397,1,4661917,5096239,62544,-82670,0,-3773,9734257,0,9734257,526735450,0,0,1]
[2448,1,9603916,3039961,819368,-4715,0,0,13458530,0,13458530,307807550,437536,21914300,1]
[2527,1,4100966,387243,2610,-5569,0,0,4485250,0,4485250,52533500,0,0,1]
[2534,1,9340005,2378893,361041,-15727,0,0,12064212,0,12064212,269897900,0,0,1]
[2536,1,6950166,477471,125278,0,0,0,7552915,0,7552915,84843995,0,0,1]
[2580,1,1943012,3033214,183031,0,-1721,0,5157536,0,5157536,266607270,0,0,1]
[2609,1,2118796,2583683,68815,0,0,0,4771294,0,4771294,173350200,0,0,1]
[2683,1,2076575,677533,33223,0,0,0,2787331,0,2787331,103036800,0,0,1]
[2687,1,2503744,6227212,191659,-109090,-305,0,8813220,1664,8814884,653829700,0,0,1]
[2689,1,14503056,3153798,633267,-48045,0,0,18242076,0,18242076,377353000,0,0,1]
[2711,1,741027,5490731,286735,-5240,0,-360710,6152543,525831,6678374,427475590,0,0,1]
[2752,1,5447152,8798875,368648,-78654,0,0,14536021,0,14536021,803799550,0,0,1]
[2753,1,2301137,4057041,163969,-66703,0,0,6455444,0,6455444,394831100,0,0,1]
[2754,1,7045290,777104,526529,-1906,-32788,0,8314229,0,8314229,123807100,0,0,1]
[2758,1,0,0,0,0,0,0,0,0,0,0,0,0,0]
[2759,1,1107644,555999,46743,-10799,0,0,1699587,0,1699587,93521700,0,0,1]
[2769,1,7157721,3632807,252952,-99042,-183,0,10944255,0,10944255,385523900,0,0,1]
[2805,1,3384094,4744775,364057,-22869,-21504,0,8448553,0,8448553,538651575,0,0,1]
[2835,1,6146254,2877077,178832,-41127,0,0,9161036,0,9161036,325987950,0,0,1]
[2853,1,15042296,2199847,187223,0,0,0,17429366,0,17429366,262455165,0,0,1]
[2854,1,6296336,802347,63844,-50436,-558,0,7111533,0,7111533,102697900,0,0,1]
[2856,1,6469398,801230,2219439,0,0,0,9490067,0,9490067,200776500,0,0,1]
[2859,1,7094576,6613254,477526,-234586,0,-4843,13945927,277,13946204,767609675,0,0,1]
[2860,1,13254434,3364779,540298,-9794,0,0,17149717,0,17149717,399972015,0,0,1]
[2862,1,0,0,0,0,0,0,0,0,0,0,0,0,0]
[2884,1,11324634,1279026,331995,0,0,0,12935655,0,12935655,166461800,0,0,1]
[2886,1,4180920,1118793,549952,0,0,0,5849665,0,5849665,160456070,0,0,1]
[2887,1,0,0,0,0,0,0,0,0,0,0,0,0,0]
[2888,1,9643792,1100327,70603,0,0,0,10814722,0,10814722,105862900,0,0,1]
[2889,1,2729710,8966588,87798,0,0,0,11784096,0,11784096,487659200,0,0,1]
[2890,1,10575160,1886035,248195,-1207,0,0,12708183,0,12708183,205844000,0,0,1]
[2895,1,15197307,4647275,1119665,-246080,0,0,20718167,0,20718167,523340115,0,0,1]
[2897,1,8145667,3966708,229520,-111139,-4645,0,12226111,0,12226111,411841200,0,0,1]
[2898,1,8491688,714524,244738,0,0,0,9450950,0,9450950,108355300,0,0,1]
[2899,1,5549879,4227037,760053,-85479,-41565,0,10409925,0,10409925,543804215,0,0,1]
[2902,1,7141165,1185831,417966,-26911,0,0,8718051,0,8718051,177511300,0,0,1]
[2903,1,4738657,1586046,48628,-11053,0,0,6362278,0,6362278,163142780,0,0,1]
[2904,1,9940462,2970125,556770,0,0,0,13467357,0,13467357,283407600,0,0,1]
[2905,1,5619995,7781285,290071,-37066,0,0,13654285,0,13654285,871106428,0,0,1]
[2906,1,2490809,908099,2677175,-21208,0,0,6054875,0,6054875,225630700,0,0,1]
[2907,1,5381117,1100075,201048,0,0,0,6682240,0,6682240,110161800,0,0,1]
[2908,1,2411023,2845104,536019,-63928,-40170,0,5688048,0,5688048,251984800,0,0,1]
[3999,1,0,0,0,0,0,0,0,0,0,0,0,0,0]

{"sheet":"Page 2 Top","index":16,"n_rows":535,"n_cols":21,"rows_kept":535,"cut":false,"hidden":true,"merged":[]}
[1,2,3,4,5,6,7,8,9,10,11,12,13,14,15,16,17,18,19,20,21]
[null,null,null,"21-1","22-1","23-1","24-1","25-1","26-1","21-2","22-2","23-2","24-2","25-2","26-2","21-RMV sub","22-RMV sub","23-RMV sub","24-RMV sub","25-RMV sub","26-RMV sub"]
["dst_num","dst_tye","dst_act_sts","mnt_crt_tax_lvy_6","mnt_cua_tax_adj_6","mnt_fid_tax_adj_6","mnt_adj_tax_lvy_6","mnt_tax_rat_6","mnt_spd_tax_lvy_6","mnt_crt_tax_lvy_5","mnt_cua_tax_adj_5","mnt_fid_tax_adj_5","mnt_adj_tax_lvy_5","mnt_tax_rat_5","mnt_spd_tax_lvy_5","tot_aud_crt_lvy_2","tot_aud_cou_adj_2","tot_aud_fiy_dip_2","tot_aud_adj_lvy_2","tot_aud_tax_rat_2","tot_aud_spr_lvy_2"]
[1,1,1,0,0,0,0,0,0,495469.91,0,0,495469.91,6.5040000000000001E-2,495502.83,495469.91,0,0,495469.91,6.5040000000000001E-2,495502.83]
[1.2,3,1,64807021.289999999,0,-7219215.71,57587805.579999998,0.13167999999999999,57588459.229999997,23999899.390000001,0,-2673487.44,21326411.949999999,4.8770000000000001E-2,21328897,88806920.680000007,0,-9892703.1500000004,78914217.530000001,0.18045,78917356.230000004]
[2,1,1,0,0,0,0,0,0,103169.96,0,0,103169.96,0.13980000000000001,103172.74,103169.96,0,0,103169.96,0.13980000000000001,103172.74]
[4,1,1,411.43,0,0,411.43,1.3999999999999999E-4,407.49,121092.15,0,0,121092.15,4.1599999999999998E-2,121081.8,121503.58,0,0,121503.58,4.1739999999999999E-2,121489.29]
[6,3,1,1319306,0,-379199,940107,6.7430000000000004E-2,940049.42,1563168,0,-449290,1113878,7.9909999999999995E-2,1114034.54,2882474,0,-828489,2053985,0.14734,2054083.96]
[11,1,1,27522906.93,0,-5099730,22423176.93,0.11723,22424930.879999999,22218729.91,0,-3400816,18817913.91,9.8379999999999995E-2,18819113.710000001,49741636.840000004,0,-8500546,41241090.840000004,0.21561,41244044.590000004]
[12,1,1,1227521.24,0,-152081,1075440.24,3.7339999999999998E-2,1075600.77,4755957.75,0,-792079,3963878.75,0.13761000000000001,3963937.38,5983478.9900000002,0,-944160,5039318.99,0.17494999999999999,5039538.1500000004]
[13,1,1,961548.86,0,-259431,702117.86,3.9550000000000002E-2,702268.47,2340583.15,0,-663639,1676944.15,9.4450000000000006E-2,1677098.78,3302132.01,0,-923070,2379062.0099999998,0.13400000000000001,2379367.25]
[14,1,1,590067.81000000006,0,-42014,548053.81000000006,4.7469999999999998E-2,548088.29,1898541.94,0,-428236,1470305.94,0.12734999999999999,1470382.21,2488609.75,0,-470250,2018359.75,0.17482,2018470.5]
[15,1,1,0,0,0,0,0,0,3139478.83,0,-511276,2628202.83,0.10357,2628343.2200000002,3139478.83,0,-511276,2628202.83,0.10357,2628343.2200000002]
[16,1,1,2569026.86,0,-293901,2275125.86,6.8760000000000002E-2,2275154.81,3613116.99,0,-511768,3101348.99,9.3729999999999994E-2,3101370.86,6182143.8499999996,0,-805669,5376474.8499999996,0.16249,5376525.6699999999]
[21,1,0,0,0,0,0,0,0,0,0,0,0,0,0,0,0,0,0,0,0]
[22,1,1,101255.96,0,0,101255.96,0,0,2279514.15,0,0,2279514.15,0.15964999999999999,2380836.34,2380770.11,0,0,2380770.11,0.15964999999999999,2380836.34]
[23,1,1,228879.64,0,0,228879.64,5.0509999999999999E-2,228863.88,416697.58,0,0,416697.58,9.196E-2,416676.35,645577.22,0,0,645577.22,0.14247000000000001,645540.23]
[24,1,0,0,0,0,0,0,0,0,0,0,0,0,0,0,0,0,0,0,0]
[25,1,1,0,0,0,0,0,0,0,0,0,0,0,0,0,0,0,0,0,0]
[31,1,1,807941.26,0,0,807941.26,3.2530000000000003E-2,808051.47,3238937.92,0,0,3238937.92,0.13039000000000001,3238912.74,4046879.18,0,0,4046879.18,0.16292000000000001,4046964.21]
[32,1,1,0,0,0,0,0,0,261963.22,0,0,261963.22,0.14248,261956.06,261963.22,0,0,261963.22,0.14248,261956.06]
[36,1,1,1028.23,0,0,1028.23,2.5300000000000001E-3,1026.44,40718.800000000003,0,0,40718.800000000003,0.10037,40721,41747.03,0,0,41747.03,0.10290000000000001,41747.440000000002]
[38,1,1,1589.07,0,0,1589.07,0.17485000000000001,1589.04,1007.64,0,0,1007.64,0.11092,1008.04,2596.71,0,0,2596.71,0.28577000000000002,2597.08]
[47,1,1,3757.3,0,0,3757.3,2.5000000000000001E-4,3770.15,2397114.0099999998,0,0,2397114.0099999998,0.15895000000000001,2397059.71,2400871.31,0,0,2400871.31,0.15920000000000001,2400829.86]
[51,1,1,95830.44,0,0,95830.44,1.8720000000000001E-2,95829,457235.39,0,0,457235.39,8.9319999999999997E-2,457235.35,553065.82999999996,0,0,553065.82999999996,0.10804,553064.35]
[55,1,0,0,0,0,0,0,0,0,0,0,0,0,0,0,0,0,0,0,0]
[57,1,0,0,0,0,0,0,0,0,0,0,0,0,0,0,0,0,0,0,0]
[58,1,0,0,0,0,0,0,0,0,0,0,0,0,0,0,0,0,0,0,0]
[60,1,0,0,0,0,0,0,0,0,0,0,0,0,0,0,0,0,0,0,0]
[62,1,0,0,0,0,0,0,0,0,0,0,0,0,0,0,0,0,0,0,0]
[70,1,0,0,0,0,0,0,0,0,0,0,0,0,0,0,0,0,0,0,0]
[72,1,0,0,0,0,0,0,0,0,0,0,0,0,0,0,0,0,0,0,0]
[75,1,1,0,0,0,0,0,0,467752.64,0,0,467752.64,0.22226000000000001,467744.61,467752.64,0,0,467752.64,0.22226000000000001,467744.61]
[77,1,1,2867454.2,0,0,2867454.2,5.5500000000000001E-2,2867454.06,5345797.1900000004,0,0,5345797.1900000004,0.10347000000000001,5345864.3600000003,8213251.3899999997,0,0,8213251.3899999997,0.15897,8213318.4199999999]
[78,1,0,0,0,0,0,0,0,0,0,0,0,0,0,0,0,0,0,0,0]
[79,1,0,0,0,0,0,0,0,0,0,0,0,0,0,0,0,0,0,0,0]
[81,1,1,112842.04,0,0,112842.04,0.26103999999999999,112843.87,46173.760000000002,0,0,46173.760000000002,0.10681,46172.44,159015.79999999999,0,0,159015.79999999999,0.36785000000000001,159016.31]
[84,1,1,0,0,0,0,0,0,386209.16,0,0,386209.16,0.14080000000000001,386203.4,386209.16,0,0,386209.16,0.14080000000000001,386203.4]
[85,1,1,37097.25,0,0,37097.25,2.5479999999999999E-2,37091.040000000001,179880.75,0,0,179880.75,0.12357,179879.9,216978,0,0,216978,0.14904999999999999,216970.94]
[88,1,1,2253779.65,0,0,2253779.65,0.18290999999999999,2253794.7799999998,1222153.47,0,0,1222153.47,9.919E-2,1222207.1200000001,3475933.12,0,0,3475933.12,0.28210000000000002,3476001.9]
[91,1,1,0,0,0,0,0,0,358513.27,0,0,358513.27,0.16397999999999999,358511.81,358513.27,0,0,358513.27,0.16397999999999999,358511.81]
[93,1,1,468276.06,0,0,468276.06,0.13292999999999999,468291.31,282813.19,0,0,282813.19,8.0280000000000004E-2,282813.71000000002,751089.25,0,0,751089.25,0.21321000000000001,751105.02]
[94,1,1,0,0,0,0,0,0,1429995.79,0,0,1429995.79,0.15901000000000001,1429962.75,1429995.79,0,0,1429995.79,0.15901000000000001,1429962.75]
[95,1,1,0,0,0,0,0,0,175539.83,0,0,175539.83,0.15920999999999999,175538.22,175539.83,0,0,175539.83,0.15920999999999999,175538.22]
[97,1,1,186530.76,0,0,186530.76,6.8180000000000004E-2,186521.47,74307.64,0,0,74307.64,2.716E-2,74302.19,260838.39999999999,0,0,260838.39999999999,9.5339999999999994E-2,260823.66]
[99,1,1,0,0,0,0,0,0,773868.99,0,0,773868.99,0.16675999999999999,773875.71,773868.99,0,0,773868.99,0.16675999999999999,773875.71]
[100,1,1,39408.89,0,0,39408.89,2.0049999999999998E-2,39416.959999999999,284243.75,0,0,284243.75,0.14457999999999999,284234.59000000003,323652.64,0,0,323652.64,0.16463,323651.55]
[108,1,1,0,0,0,0,0,0,760462,0,-98095,662367,9.9599999999999994E-2,662366.98,760462,0,-98095,662367,9.9599999999999994E-2,662366.98]
[110,1,1,0,0,0,0,0,0,3066287,0,-272111,2794176,0.12564,2794175.88,3066287,0,-272111,2794176,0.12564,2794175.88]
[111,1,1,38867,0,-4405,34462,3.8700000000000002E-3,34461.949999999997,1178483,0,-133561,1044922,0.11741,1044921.98,1217350,0,-137966,1079384,0.12128,1079383.93]
[112,1,1,12323051,0,-1008316,11314735,0.16594,11314734.880000001,5362436,0,-438774,4923662,7.2209999999999996E-2,4923661.58,17685487,0,-1447090,16238397,0.23815,16238396.460000001]
[113,1,1,0,0,0,0,0,0,684604.79,0,0,684604.79,8.7379999999999999E-2,684618.61,684604.79,0,0,684604.79,8.7379999999999999E-2,684618.61]
[114,1,0,0,0,0,0,0,0,0,0,0,0,0,0,0,0,0,0,0,0]
[115,1,1,0,0,0,0,0,0,724245.65,0,0,724245.65,0.17415,724255.03,724245.65,0,0,724245.65,0.17415,724255.03]
[116,1,1,0,0,0,0,0,0,784856.9,0,0,784856.9,0.16258,784872.09,784856.9,0,0,784856.9,0.16258,784872.09]
[117,1,0,0,0,0,0,0,0,0,0,0,0,0,0,0,0,0,0,0,0]
[118,1,1,177294.47,0,0,177294.47,3.7740000000000003E-2,177290.96,188683.96,0,0,188683.96,4.0169999999999997E-2,188706.36,365978.43,0,0,365978.43,7.7909999999999993E-2,365997.32]
[119,1,0,0,0,0,0,0,0,0,0,0,0,0,0,0,0,0,0,0,0]
[126,1,0,0,0,0,0,0,0,0,0,0,0,0,0,0,0,0,0,0,0]
[127,1,0,0,0,0,0,0,0,0,0,0,0,0,0,0,0,0,0,0,0]
[128,1,0,0,0,0,0,0,0,0,0,0,0,0,0,0,0,0,0,0,0]
[129,1,1,111413.65,0,0,111413.65,3.1289999999999998E-2,111448.87,594517.56000000006,0,0,594517.56000000006,0.16692000000000001,594536.43999999994,705931.21,0,0,705931.21,0.19821,705985.31]
[138,1,1,0,0,0,0,0,0,1848271.44,0,0,1848271.44,0.12399,1848271.07,1848271.44,0,0,1848271.44,0.12399,1848271.07]
[139,1,1,0,0,0,0,0,0,507513.18,0,0,507513.18,0.13303999999999999,507513.01,507513.18,0,0,507513.18,0.13303999999999999,507513.01]
[140,1,0,0,0,0,0,0,0,0,0,0,0,0,0,0,0,0,0,0,0]
[141,1,0,0,0,0,0,0,0,0,0,0,0,0,0,0,0,0,0,0,0]
[145,1,0,0,0,0,0,0,0,0,0,0,0,0,0,0,0,0,0,0,0]
[146,1,1,272372.96000000002,0,0,272372.96000000002,8.5879999999999998E-2,272372.96999999997,364145.02,0,0,364145.02,0.11482000000000001,364144.98,636517.98,0,0,636517.98,0.20069999999999999,636517.94999999995]
[147,1,0,0,0,0,0,0,0,0,0,0,0,0,0,0,0,0,0,0,0]
[150,1,1,229289.33,0,0,229289.33,6.8080000000000002E-2,229288.99,87809.72,0,0,87809.72,2.6069999999999999E-2,87809.97,317099.05,0,0,317099.05,9.4149999999999998E-2,317098.96000000002]
[152,1,1,2453675.2400000002,0,0,2453675.2400000002,7.7130000000000004E-2,2453674.9,3306721.14,0,0,3306721.14,0.10394,3306720.74,5760396.3799999999,0,0,5760396.3799999999,0.18107000000000001,5760395.6399999997]
[158,1,0,0,0,0,0,0,0,0,0,0,0,0,0,0,0,0,0,0,0]
[161,1,0,0,0,0,0,0,0,0,0,0,0,0,0,0,0,0,0,0,0]
[162,1,1,0,0,0,0,0,0,418024,0,0,418024,0.15143000000000001,418035.54,418024,0,0,418024,0.15143000000000001,418035.54]
[166,1,1,392900.67,0,0,392900.67,6.2350000000000003E-2,392881.14,440694.92,0,0,440694.92,6.9940000000000002E-2,440707.41,833595.59,0,0,833595.59,0.13228999999999999,833588.55]
[173,1,1,387184.34,-0.34,0,387184,0.30048999999999998,387195.19,123385.87,0.13,0,123386,9.5759999999999998E-2,123391.16,510570.21,-0.21,0,510570,0.39624999999999999,510586.35]
[175,1,0,0,0,0,0,0,0,0,0,0,0,0,0,0,0,0,0,0,0]
[177,1,1,669719.36,-0.36,0,669719,0.18004000000000001,669754.02,370035.58,0.42,0,370036,9.9479999999999999E-2,370068.47999999998,1039754.94,0.06,0,1039755,0.27951999999999999,1039822.5]
[178,1,0,0,0,0,0,0,0,0,0,0,0,0,0,0,0,0,0,0,0]
[181,1,1,0,0,0,0,0,0,5091754.28,0,0,5091754.28,0.13566,5091781.72,5091754.28,0,0,5091754.28,0.13566,5091781.72]
[182,1,1,0,0,0,0,0,0,876443.84,0,0,876443.84,9.3079999999999996E-2,876466.64,876443.84,0,0,876443.84,9.3079999999999996E-2,876466.64]
[186,1,1,0,0,0,0,0,0,1326475.1100000001,0,0,1326475.1100000001,0.10487,1326558.23,1326475.1100000001,0,0,1326475.1100000001,0.10487,1326558.23]
[191,1,1,12748545,0,-1516908,11231637,0.16964000000000001,11232459.51,4789229,0,-569855,4219374,6.3719999999999999E-2,4219124.74,17537774,0,-2086763,15451011,0.23336000000000001,15451584.25]
[192,1,1,3272050,0,-460372,2811678,0.10059,2812052.65,2740060,0,-385523,2354537,8.4220000000000003E-2,2354419.67,6012110,0,-845895,5166215,0.18481,5166472.32]
[194,1,1,12279126,0,-1258254,11020872,0.16844999999999999,11021529.75,6266605,0,-642145,5624460,8.5959999999999995E-2,5624284.3399999999,18545731,0,-1900399,16645332,0.25441000000000003,16645814.09]
[195,1,1,0,0,0,0,0,0,439161,0,-16351,422810,0.13872999999999999,422806.98,439161,0,-16351,422810,0.13872999999999999,422806.98]
[196,1,1,31153044,0,-3394899,27758145,0.17802000000000001,27758798.289999999,16762236,0,-1826665,14935571,9.5780000000000004E-2,14935050.560000001,47915280,0,-5221564,42693716,0.27379999999999999,42693848.850000001]
[197,1,1,7504872,0,-673322,6831550,0.12404,6831844.1399999997,2753650,0,-247052,2506598,4.5510000000000002E-2,2506588.41,10258522,0,-920374,9338148,0.16955000000000001,9338432.5500000007]
[199,1,1,1957341,0,-227739,1729602,6.3589999999999994E-2,1729490.98,2397882,0,-278997,2118885,7.7920000000000003E-2,2119231.6,4355223,0,-506736,3848487,0.14151,3848722.58]
[200,1,1,4737163,0,-641475,4095688,0.14493,4095677.27,3340486,0,-452347,2888139,0.1022,2888140.6,8077649,0,-1093822,6983827,0.24712999999999999,6983817.8700000001]
[201,1,0,0,0,0,0,0,0,0,0,0,0,0,0,0,0,0,0,0,0]
[202,1,0,0,0,0,0,0,0,0,0,0,0,0,0,0,0,0,0,0,0]
[203,1,1,351762,0,0,351762,0.12765000000000001,351766.13,256292,0,0,256292,9.2999999999999999E-2,256280.84,608054,0,0,608054,0.22065000000000001,608046.97]
[204,1,1,1189,0,0,1189,1.8000000000000001E-4,1199.6400000000001,928737,0,0,928737,0.13935,928724.59,929926,0,0,929926,0.13952999999999999,929924.23]
[205,1,0,0,0,0,0,0,0,0,0,0,0,0,0,0,0,0,0,0,0]
[206,1,1,0,0,0,0,0,0,3659569.23,0,0,3659569.23,0.12130000000000001,3659971.44,3659569.23,0,0,3659569.23,0.12130000000000001,3659971.44]
[207,1,0,0,0,0,0,0,0,0,0,0,0,0,0,0,0,0,0,0,0]
[208,1,0,0,0,0,0,0,0,0,0,0,0,0,0,0,0,0,0,0,0]
[209,1,0,0,0,0,0,0,0,0,0,0,0,0,0,0,0,0,0,0,0]
[213,1,1,0,0,0,0,0,0,202565.71,0,0,202565.71,8.4220000000000003E-2,202601.65,202565.71,0,0,202565.71,8.4220000000000003E-2,202601.65]
[217,1,0,0,0,0,0,0,0,0,0,0,0,0,0,0,0,0,0,0,0]
[218,1,0,0,0,0,0,0,0,0,0,0,0,0,0,0,0,0,0,0,0]
[219,1,0,0,0,0,0,0,0,0,0,0,0,0,0,0,0,0,0,0,0]
[222,1,0,0,0,0,0,0,0,0,0,0,0,0,0,0,0,0,0,0,0]
[223,1,0,0,0,0,0,0,0,0,0,0,0,0,0,0,0,0,0,0,0]
[224,1,0,0,0,0,0,0,0,0,0,0,0,0,0,0,0,0,0,0,0]
[225,1,0,0,0,0,0,0,0,0,0,0,0,0,0,0,0,0,0,0,0]
[227,1,1,391364,0,0,391364,0.11061,391399.37,384974,0,0,384974,0.10879,384959.21,776338,0,0,776338,0.21940000000000001,776358.58]
[228,1,0,0,0,0,0,0,0,0,0,0,0,0,0,0,0,0,0,0,0]
[229,1,1,0,0,0,0,0,0,97806.78,0,0,97806.78,8.5000000000000006E-2,97806.16,97806.78,0,0,97806.78,8.5000000000000006E-2,97806.16]
[232,1,0,0,0,0,0,0,0,0,0,0,0,0,0,0,0,0,0,0,0]
[233,1,0,0,0,0,0,0,0,0,0,0,0,0,0,0,0,0,0,0,0]
[234,1,0,0,0,0,0,0,0,0,0,0,0,0,0,0,0,0,0,0,0]
[236,1,0,0,0,0,0,0,0,0,0,0,0,0,0,0,0,0,0,0,0]
[237,1,0,0,0,0,0,0,0,0,0,0,0,0,0,0,0,0,0,0,0]
[238,1,1,309381.49,0,0,309381.49,0.31441999999999998,309382.09999999998,85370.28,0,0,85370.28,8.6760000000000004E-2,85369.86,394751.77,0,0,394751.77,0.40117999999999998,394751.96]
[239,1,1,274048.90000000002,0,0,274048.90000000002,0.11493,274043.37,275883.83,0,0,275883.83,0.1157,275879.39,549932.73,0,0,549932.73,0.23063,549922.76]
[240,1,0,0,0,0,0,0,0,0,0,0,0,0,0,0,0,0,0,0,0]
[241,1,1,1511664.03,0,0,1511664.03,0.11817,1511681.5,1352332.8,0,0,1352332.8,0.10571,1352287.82,2863996.83,0,0,2863996.83,0.22388,2863969.32]
[242,1,1,142275.42000000001,0,0,142275.42000000001,0.18004999999999999,142278.32999999999,186729.09,0,0,186729.09,0.23630000000000001,186727.96,329004.51,0,0,329004.51,0.41635,329006.28999999998]
[243,1,0,0,0,0,0,0,0,0,0,0,0,0,0,0,0,0,0,0,0]
[244,1,0,0,0,0,0,0,0,0,0,0,0,0,0,0,0,0,0,0,0]
[245,1,0,0,0,0,0,0,0,0,0,0,0,0,0,0,0,0,0,0,0]
[252,1,1,619900,0,-609.01,619290.99,8.5779999999999995E-2,619297.89,907928.72,0.28000000000000003,-891.99,907037.01,0.12564,907071.42,1527828.72,0.28000000000000003,-1501,1526328,0.21142,1526369.31]
[253,1,1,14519.28,-0.28999999999999998,0,14518.99,7.1399999999999996E-3,14527.7,320488.94,0.06,0,320489,0.15751000000000001,320484.42,335008.21999999997,-0.23,0,335007.99,0.16464999999999999,335012.12]
[254,1,0,0,0,0,0,0,0,0,0,0,0,0,0,0,0,0,0,0,0]
[255,1,1,184377.24,-0.24,0,184377,3.3759999999999998E-2,184402.08,642465.56999999995,0.43,0,642466,0.11762,642457.73,826842.81,0.19,0,826843,0.15137999999999999,826859.81]
[256,1,1,2371097.75,0.25,0,2371098,9.7239999999999993E-2,2371156.27,1575005.68,-0.68,0,1575005,6.4589999999999995E-2,1574999.83,3946103.43,-0.43,0,3946103,0.16183,3946156.1]
[258,1,0,0,0,0,0,0,0,0,0,0,0,0,0,0,0,0,0,0,0]
[260,1,0,0,0,0,0,0,0,0,0,0,0,0,0,0,0,0,0,0,0]
[261,1,1,189586.96,0,0,189586.96,0.18864,189604.89,146429.70000000001,0,0,146429.70000000001,0.14568999999999999,146435.20000000001,336016.66,0,0,336016.66,0.33433000000000002,336040.09]
[262,1,0,0,0,0,0,0,0,0,0,0,0,0,0,0,0,0,0,0,0]
[263,1,0,0,0,0,0,0,0,0,0,0,0,0,0,0,0,0,0,0,0]
[264,1,1,194156.34,0,0,194156.34,0.36908000000000002,194166.34,37040.82,0,0,37040.82,7.041E-2,37041.43,231197.16,0,0,231197.16,0.43948999999999999,231207.77]
[265,1,0,0,0,0,0,0,0,0,0,0,0,0,0,0,0,0,0,0,0]
[270,1,1,15894399.83,0,-963916.02,14930483.810000001,0.14607999999999999,14930882.49,3716292.39,0,-225373.56,3490918.83,3.4160000000000003E-2,3491504.28,19610692.219999999,0,-1189289.58,18421402.640000001,0.18024000000000001,18422386.77]
[271,1,1,13997530.92,0,-975309.52,13022221.4,0.10989,13023139.390000001,9674197.2200000007,0,-674073.28,9000123.9399999995,7.5950000000000004E-2,9000886.6799999997,23671728.140000001,0,-1649382.8,22022345.34,0.18584000000000001,22024026.07]
[272,1,1,14181737.279999999,0,-688375.09,13493362.189999999,0.14579,13493371.380000001,7231350,0,-351007.59,6880342.4100000001,7.4340000000000003E-2,6880425.46,21413087.280000001,0,-1039382.68,20373704.600000001,0.22012999999999999,20373796.84]
[273,1,1,12505695.41,0,-326314.92,12179380.49,0.13536000000000001,12179491.449999999,4825101.13,0,-125903.13,4699198,5.2229999999999999E-2,4699577.71,17330796.539999999,0,-452218.05,16878578.489999998,0.18759000000000001,16879069.16]
[276,1,1,18456472.260000002,0,-596095.9,17860376.359999999,0.22906000000000001,17860863.25,5688512.9699999997,0,-183724.6,5504788.3700000001,7.0599999999999996E-2,5505007.1799999997,24144985.23,0,-779820.5,23365164.73,0.29965999999999998,23365870.43]
[277,1,1,3739636.43,0,-135860.89000000001,3603775.54,0.10811999999999999,3604024.24,1379830.18,0,-50129.13,1329701.05,3.9899999999999998E-2,1330008.94,5119466.6100000003,0,-185990.02,4933476.59,0.14802000000000001,4934033.18]
[278,1,1,5996856.5199999996,0,-125254.95,5871601.5700000003,0.18451000000000001,5871854.6399999997,1486202.47,0,-31041.77,1455160.7,4.573E-2,1455313.6,7483058.9900000002,0,-156296.72,7326762.2699999996,0.23024,7327168.2400000002]
[279,1,1,33991373.439999998,0,-3964207.92,30027165.52,0.20677999999999999,30027267.600000001,11240458.49,0,-1310905.32,9929553.1699999999,6.8379999999999996E-2,9929705.7699999996,45231831.93,0,-5275113.24,39956718.689999998,0.27516000000000002,39956973.369999997]
[280,1,1,4025788.12,0,-581851.25,3443936.87,8.1290000000000001E-2,3444186.72,2253437.44,0,-325690.86,1927746.58,4.5499999999999999E-2,1927795.5,6279225.5599999996,0,-907542.11,5371683.4500000002,0.12679000000000001,5371982.2199999997]
[281,1,1,18494827.670000002,0,-3178250.39,15316577.279999999,0.18026,15316917.029999999,7112482.6699999999,0,-1222247.7,5890234.9699999997,6.9330000000000003E-2,5891056.5700000003,25607310.34,0,-4400498.09,21206812.25,0.24959000000000001,21207973.600000001]
[282,1,1,2306849.23,0,-309596.92,1997252.31,0.19561000000000001,1997332.83,1080037,0,-144949.04,935087.96,9.1579999999999995E-2,935104.24,3386886.23,0,-454545.96,2932340.27,0.28719,2932437.07]
[283,1,1,10009928.82,0,-843917.99,9166010.8300000001,0.15204000000000001,9166067.9399999995,2582113.46,0,-217692.23,2364421.23,3.9219999999999998E-2,2364464.5099999998,12592042.279999999,0,-1061610.22,11530432.060000001,0.19126000000000001,11530532.449999999]
[284,1,1,18490052.5,0,-837467.23,17652585.27,0.14563000000000001,17653777.030000001,6302266.5800000001,0,-285447.87,6016818.71,4.9639999999999997E-2,6017534.1100000003,24792319.079999998,0,-1122915.1000000001,23669403.98,0.19527,23671311.140000001]
[286,1,1,0,0,0,0,0,0,1101581.79,0,-374153.73,727428.06,0.12136,727435.64,1101581.79,0,-374153.73,727428.06,0.12136,727435.64]
[287,6,0,0,0,0,0,0,0,0,0,0,0,0,0,0,0,0,0,0,0]
[288,6,0,0,0,0,0,0,0,0,0,0,0,0,0,0,0,0,0,0,0]
[294,1,1,93087,0,0,93087,5.7770000000000002E-2,93079.03,728726,0,0,728726,0.45229000000000003,728729.69,821813,0,0,821813,0.51005999999999996,821808.72]
[297,1,1,318146,0,0,318146,0.30392999999999998,318150.05,117181,0,0,117181,0.11194,117177.36,435327,0,0,435327,0.41587000000000002,435327.41]
[299,1,1,164935,0,0,164935,4.9829999999999999E-2,164951.1,350939,0,0,350939,0.10600999999999999,350922.46,515874,0,0,515874,0.15584000000000001,515873.56]
[300,1,1,170470,0,0,170470,2.63E-2,170448.58,791293,0,0,791293,0.1221,791322.1,961763,0,0,961763,0.1484,961770.68]
[301,1,0,0,0,0,0,0,0,0,0,0,0,0,0,0,0,0,0,0,0]
[306,1,1,0,0,0,0,0,0,163810,0,0,163810,0.13732,163806.28,163810,0,0,163810,0.13732,163806.28]
[308,1,1,11737,0,0,11737,4.96E-3,11735.07,488279,0,0,488279,0.20638000000000001,488283.01,500016,0,0,500016,0.21134,500018.08]
[309,1,1,0,0,0,0,0,0,1321666,0,0,1321666,0.12675,1321692.04,1321666,0,0,1321666,0.12675,1321692.04]
[314,1,1,3869,0,0,3869,1.15E-3,3868.97,334654,0,0,334654,9.9720000000000003E-2,334653.99,338523,0,0,338523,0.10087,338522.96]
[316,1,1,0,0,0,0,0,0,585519.69999999995,0,-52210.28,533309.42000000004,9.801E-2,533321.99,585519.69999999995,0,-52210.28,533309.42000000004,9.801E-2,533321.99]
[317,1,1,0,0,0,0,0,0,603225.97,0,0,603225.97,0.14307,603238.69999999995,603225.97,0,0,603225.97,0.14307,603238.69999999995]
[318,1,1,0,0,0,0,0,0,3543602.17,0,-92094.85,3451507.32,0.12501999999999999,3451424.74,3543602.17,0,-92094.85,3451507.32,0.12501999999999999,3451424.74]
[319,1,1,1174.82,0,-70.650000000000006,1104.17,5.1999999999999995E-4,1108.2,330720.55,0,-19889.669999999998,310830.88,0.14585000000000001,310828.64,331895.37,0,-19960.32,311935.05,0.14637,311936.84000000003]
[323,2,1,62709.66,0,0,62709.66,0.23458000000000001,62710,21316.27,0,0,21316.27,7.9740000000000005E-2,21316,84025.93,0,0,84025.93,0.31431999999999999,84026]
[324,1,0,0,0,0,0,0,0,0,0,0,0,0,0,0,0,0,0,0,0]
[325,1,0,0,0,0,0,0,0,0,0,0,0,0,0,0,0,0,0,0,0]
[328,1,0,0,0,0,0,0,0,0,0,0,0,0,0,0,0,0,0,0,0]
[330,1,1,462963.02,-0.02,0,462963,0.42355999999999999,462967.18,103319.06,-0.06,0,103319,9.4520000000000007E-2,103313.95,566282.07999999996,-0.08,0,566282,0.51807999999999998,566281.13]
[332,1,1,0,0,0,0,0,0,800803.98,0,0,800803.98,0.14413000000000001,800808.73,800803.98,0,0,800803.98,0.14413000000000001,800808.73]
[333,1,1,0,0,0,0,0,0,178660.29,0,0,178660.29,0.11556,178666.36,178660.29,0,0,178660.29,0.11556,178666.36]
[341,1,0,0,0,0,0,0,0,0,0,0,0,0,0,0,0,0,0,0,0]
[345,1,1,59049.1,0,0,59049.1,6.62E-3,59101.23,1285097.1499999999,0,0,1285097.1499999999,0.14396,1285228.52,1344146.25,0,0,1344146.25,0.15057999999999999,1344329.75]
[346,1,0,0,0,0,0,0,0,0,0,0,0,0,0,0,0,0,0,0,0]
[347,1,1,634455.77,0,0,634455.77,4.0189999999999997E-2,634559.94999999995,1669068.28,0,0,1669068.28,0.10574,1669528.97,2303524.0499999998,0,0,2303524.0499999998,0.14593,2304088.92]
[351,1,0,0,0,0,0,0,0,0,0,0,0,0,0,0,0,0,0,0,0]
[352,1,0,0,0,0,0,0,0,0,0,0,0,0,0,0,0,0,0,0,0]
[353,1,0,0,0,0,0,0,0,0,0,0,0,0,0,0,0,0,0,0,0]
[354,1,0,0,0,0,0,0,0,0,0,0,0,0,0,0,0,0,0,0,0]
[356,1,1,332127,0,0,332127,1.2066300000000001,332126.05,26995,0,0,26995,9.8070000000000004E-2,26993.86,359122,0,0,359122,1.3047,359119.91]
[361,1,1,180440.52,0,0,180440.52,3.3840000000000002E-2,180462.24,508670.53,0,0,508670.53,9.5390000000000003E-2,508696.61,689111.05,0,0,689111.05,0.12923000000000001,689158.85]
[362,1,1,7066.34,0,0,7066.34,1.14E-2,7068.68,63620.87,0,0,63620.87,0.1026,63618.12,70687.210000000006,0,0,70687.210000000006,0.114,70686.8]
[363,1,1,9058.52,0,0,9058.52,1.8870000000000001E-2,9059.15,0,0,0,0,0,0,9058.52,0,0,9058.52,1.8870000000000001E-2,9059.15]
[371,1,0,0,0,0,0,0,0,0,0,0,0,0,0,0,0,0,0,0,0]
[376,1,0,0,0,0,0,0,0,0,0,0,0,0,0,0,0,0,0,0,0]
[377,1,0,0,0,0,0,0,0,0,0,0,0,0,0,0,0,0,0,0,0]
[378,1,1,109013,0,0,109013,8.7129999999999999E-2,109011.51,155783,0,0,155783,0.12451,155778.99,264796,0,0,264796,0.21163999999999999,264790.5]
[381,1,1,0,0,0,0,0,0,1176087.0900000001,0,0,1176087.0900000001,9.7309999999999994E-2,1176059.57,1176087.0900000001,0,0,1176087.0900000001,9.7309999999999994E-2,1176059.57]
[390,1,1,93037,0,0,93037,3.8719999999999997E-2,93052.18,271518,0,0,271518,0.113,271562.39,364555,0,0,364555,0.15171999999999999,364614.57]
[391,1,1,344217.18,0,0,344217.18,0.13688,344210.49,441664.22,0,0,441664.22,0.17563000000000001,441654.65,785881.4,0,0,785881.4,0.31251000000000001,785865.14]
[392,1,0,0,0,0,0,0,0,0,0,0,0,0,0,0,0,0,0,0,0]
[393,1,0,0,0,0,0,0,0,0,0,0,0,0,0,0,0,0,0,0,0]
[394,1,0,0,0,0,0,0,0,0,0,0,0,0,0,0,0,0,0,0,0]
[395,1,0,0,0,0,0,0,0,0,0,0,0,0,0,0,0,0,0,0,0]
[402,1,1,354297,0,0,354297,0.55808000000000002,354303.78,47115,0,0,47115,7.4219999999999994E-2,47119.46,401412,0,0,401412,0.63229999999999997,401423.24]
[403,1,1,175548,0,0,175548,0.26638000000000001,175558.01,36438,0,0,36438,5.5289999999999999E-2,36438.93,211986,0,0,211986,0.32167000000000001,211996.94]
[404,1,1,354717,0,0,354717,0.40156999999999998,354733.28,77061,0,0,77061,8.7239999999999998E-2,77064.850000000006,431778,0,0,431778,0.48881000000000002,431798.13]
[408,1,0,0,0,0,0,0,0,0,0,0,0,0,0,0,0,0,0,0,0]
[409,1,0,0,0,0,0,0,0,0,0,0,0,0,0,0,0,0,0,0,0]
[411,1,0,0,0,0,0,0,0,0,0,0,0,0,0,0,0,0,0,0,0]
[412,1,0,0,0,0,0,0,0,0,0,0,0,0,0,0,0,0,0,0,0]
[413,1,1,402413,0,0,402413,3.6749999999999998E-2,402429.92,1224869,0,0,1224869,0.11187,1225029.53,1627282,0,0,1627282,0.14862,1627459.45]
[414,1,1,44882,0,0,44882,3.4139999999999997E-2,44887.85,164548,0,0,164548,0.12515000000000001,164549.35,209430,0,0,209430,0.15928999999999999,209437.2]
[415,1,1,113394,0,0,113394,0.16822999999999999,113406.2,103099,0,0,103099,0.15295,103105.74,216493,0,0,216493,0.32118000000000002,216511.94]
[417,1,0,0,0,0,0,0,0,0,0,0,0,0,0,0,0,0,0,0,0]
[418,1,0,0,0,0,0,0,0,0,0,0,0,0,0,0,0,0,0,0,0]
[421,1,0,0,0,0,0,0,0,0,0,0,0,0,0,0,0,0,0,0,0]
[422,1,0,0,0,0,0,0,0,0,0,0,0,0,0,0,0,0,0,0,0]
[423,1,1,1022905.21,-0.21,0,1022905,8.3169999999999994E-2,1022927.17,1251212.57,0.43,0,1251213,0.10173,1251200.92,2274117.7799999998,0.22,0,2274118,0.18490000000000001,2274128.09]
[424,1,1,264727.39,-0.39,-5,264722,0.13805999999999999,264727.15000000002,220421.36,-0.36,-4,220417,0.11495,220414.21,485148.75,-0.75,-9,485139,0.25301000000000001,485141.36]
[425,1,0,0,0,0,0,0,0,0,0,0,0,0,0,0,0,0,0,0,0]
[426,1,0,0,0,0,0,0,0,0,0,0,0,0,0,0,0,0,0,0,0]
[427,1,0,0,0,0,0,0,0,0,0,0,0,0,0,0,0,0,0,0,0]
[432,1,1,0,0,0,0,0,0,150955.29,0,0,150955.29,0.15140000000000001,150958.21,150955.29,0,0,150955.29,0.15140000000000001,150958.21]
[435,1,1,0,0,0,0,0,0,240468.67,0,0,240468.67,0.16546,240472.78,240468.67,0,0,240468.67,0.16546,240472.78]
[436,1,0,0,0,0,0,0,0,0,0,0,0,0,0,0,0,0,0,0,0]
[437,1,0,0,0,0,0,0,0,0,0,0,0,0,0,0,0,0,0,0,0]
[440,1,0,0,0,0,0,0,0,0,0,0,0,0,0,0,0,0,0,0,0]
[441,1,1,408206.92,0,0,408206.92,0.21138999999999999,408237,225639.49,0,0,225639.49,0.11684,225641.76,633846.41,0,0,633846.41,0.32823000000000002,633878.76]
[442,1,0,0,0,0,0,0,0,0,0,0,0,0,0,0,0,0,0,0,0]
[443,1,0,0,0,0,0,0,0,0,0,0,0,0,0,0,0,0,0,0,0]
[444,1,0,0,0,0,0,0,0,0,0,0,0,0,0,0,0,0,0,0,0]
[446,1,0,0,0,0,0,0,0,0,0,0,0,0,0,0,0,0,0,0,0]
[447,1,1,30544.49,0,0,30544.49,9.3079999999999996E-2,30545.599999999999,42384.76,0,0,42384.76,0.12916,42385.79,72929.25,0,0,72929.25,0.22223999999999999,72931.39]
[451,1,0,0,0,0,0,0,0,0,0,0,0,0,0,0,0,0,0,0,0]
[453,1,0,0,0,0,0,0,0,0,0,0,0,0,0,0,0,0,0,0,0]
[454,1,0,0,0,0,0,0,0,0,0,0,0,0,0,0,0,0,0,0,0]
[456,1,0,0,0,0,0,0,0,0,0,0,0,0,0,0,0,0,0,0,0]
[457,1,0,0,0,0,0,0,0,0,0,0,0,0,0,0,0,0,0,0,0]
[458,1,1,457264.5,0,0,457264.5,0.4617,457262.19,84701.119999999995,0,0,84701.119999999995,8.5519999999999999E-2,84697.99,541965.62,0,0,541965.62,0.54722000000000004,541960.18000000005]
[459,1,0,0,0,0,0,0,0,0,0,0,0,0,0,0,0,0,0,0,0]
[460,1,0,0,0,0,0,0,0,0,0,0,0,0,0,0,0,0,0,0,0]
[461,1,0,0,0,0,0,0,0,0,0,0,0,0,0,0,0,0,0,0,0]
[463,1,1,61115.31,0,0,61115.31,2.1090000000000001E-2,61132.25,405337.83,0,0,405337.83,0.13983999999999999,405345.4,466453.14,0,0,466453.14,0.16092999999999999,466477.65]
[464,1,0,0,0,0,0,0,0,0,0,0,0,0,0,0,0,0,0,0,0]
[465,1,1,0,0,0,0,0,0,910060.05,0,0,910060.05,0.12179,910069.44,910060.05,0,0,910060.05,0.12179,910069.44]
[466,1,1,0,0,0,0,0,0,1060564.94,0,0,1060564.94,0.15518999999999999,1060607.6100000001,1060564.94,0,0,1060564.94,0.15518999999999999,1060607.6100000001]
[473,1,1,250752,0,0,250752,0.10022,250767.25,393587,0,0,393587,0.15731000000000001,393616.01,644339,0,0,644339,0.25752999999999998,644383.26]
[477,1,1,1151,0,0,1151,9.0000000000000006E-5,1216.99,1774739,0,0,1774739,0.13125999999999999,1774907.04,1775890,0,0,1775890,0.13134999999999999,1776124.03]
[480,1,1,144891,0,0,144891,4.8860000000000001E-2,144896.63,299395,0,0,299395,0.10097,299431.28000000003,444286,0,0,444286,0.14982999999999999,444327.91]
[482,1,1,656359,0,0,656359,6.7089999999999997E-2,656357.43999999994,1002225,0,0,1002225,0.10244,1002224.25,1658584,0,0,1658584,0.16952999999999999,1658581.69]
[483,1,0,0,0,0,0,0,0,0,0,0,0,0,0,0,0,0,0,0,0]
[484,1,1,0,0,0,0,0,0,363902,0,0,363902,0.12897,363901.06,363902,0,0,363902,0.12897,363901.06]
[485,1,1,0,0,0,0,0,0,472615,0,0,472615,0.19947999999999999,472613.83,472615,0,0,472615,0.19947999999999999,472613.83]
[486,1,1,86751,0,0,86751,8.0699999999999994E-2,86751.45,107756,0,0,107756,0.10024,107755.62,194507,0,0,194507,0.18093999999999999,194507.07]
[487,1,1,152269,0,0,152269,0.14171,152268.95000000001,170831,0,0,170831,0.15898999999999999,170831.13,323100,0,0,323100,0.30070000000000002,323100.08]
[492,1,1,103071.39,-0.39,0,103071,7.7600000000000004E-3,103037.02,1990127.3,-0.3,0,1990127,0.14988000000000001,1990101.54,2093198.69,-0.69,0,2093198,0.15764,2093138.56]
[495,1,1,185928.43,-0.43,0,185928,0.18387000000000001,185923.09,120938.78,0.22,0,120939,0.1196,120935.45,306867.21000000002,-0.21,0,306867,0.30347000000000002,306858.53999999998]
[497,1,1,3030.77,0,0,3030.77,5.4200000000000003E-3,3029.43,103074.03,0,0,103074.03,0.18440000000000001,103067.61,106104.8,0,0,106104.8,0.18981999999999999,106097.04]
[499,1,1,328559.18,0,0,328559.18,0.33285999999999999,328553.46000000002,85450.62,0,0,85450.62,8.6569999999999994E-2,85449.96,414009.8,0,0,414009.8,0.41943000000000003,414003.42]
[500,1,1,557735.71,0.28999999999999998,0,557736,0.3034,557728.99,155098.43,-0.43,0,155098,8.4370000000000001E-2,155094.25,712834.14,-0.14000000000000001,0,712834,0.38777,712823.24]
[504,1,0,0,0,0,0,0,0,0,0,0,0,0,0,0,0,0,0,0,0]
[505,1,1,646574.19999999995,0,0,646574.19999999995,0.65441000000000005,646574.09,114637.6,0,0,114637.6,0.11602999999999999,114640.66,761211.8,0,0,761211.8,0.77044000000000001,761214.75]
[507,1,1,335732.59,0,0,335732.59,0.18309,335733.41,181294.41,0,0,181294.41,9.887E-2,181298.61,517027,0,0,517027,0.28195999999999999,517032.02]
[508,1,1,311999.28000000003,0,0,311999.28000000003,3.6400000000000002E-2,312034.08,1202620,0,0,1202620,0.14029,1202617.06,1514619.28,0,0,1514619.28,0.17669000000000001,1514651.14]
[511,1,1,192565.22,0,0,192565.22,0.15407000000000001,192569.78,201668.37,0,0,201668.37,0.16137000000000001,201693.94,394233.59,0,0,394233.59,0.31544,394263.72]
[513,1,0,0,0,0,0,0,0,0,0,0,0,0,0,0,0,0,0,0,0]
[514,1,1,99647.93,0,0,99647.93,0.31557000000000002,99649.12,31764.75,0,0,31764.75,0.10059999999999999,31766.97,131412.68,0,0,131412.68,0.41616999999999998,131416.09]
[516,1,0,0,0,0,0,0,0,0,0,0,0,0,0,0,0,0,0,0,0]
[518,1,1,784524.17,0,0,784524.17,9.2179999999999998E-2,784532.73,1109567.32,0,0,1109567.32,0.13039000000000001,1109733.3799999999,1894091.49,0,0,1894091.49,0.22256999999999999,1894266.11]
[521,1,0,0,0,0,0,0,0,0,0,0,0,0,0,0,0,0,0,0,0]
[522,1,0,0,0,0,0,0,0,0,0,0,0,0,0,0,0,0,0,0,0]
[523,1,0,0,0,0,0,0,0,0,0,0,0,0,0,0,0,0,0,0,0]
[524,1,0,0,0,0,0,0,0,0,0,0,0,0,0,0,0,0,0,0,0]
[525,1,0,0,0,0,0,0,0,0,0,0,0,0,0,0,0,0,0,0,0]
[526,1,0,0,0,0,0,0,0,0,0,0,0,0,0,0,0,0,0,0,0]
[531,1,1,0,0,0,0,0,0,949748,0,0,949748,0.13075999999999999,949764.15,949748,0,0,949748,0.13075999999999999,949764.15]
[533,1,1,0,0,0,0,0,0,505362,0,0,505362,0.17166000000000001,505352.62,505362,0,0,505362,0.17166000000000001,505352.62]
[534,1,1,323859,0,0,323859,4.929E-2,323771.17,860694,0,0,860694,0.13100999999999999,860565.26,1184553,0,0,1184553,0.18029999999999999,1184336.43]
[535,1,1,15374416,0,0,15374416,0.12939000000000001,15375669.890000001,13087223,0,0,13087223,0.11013000000000001,13086965.960000001,28461639,0,0,28461639,0.23952000000000001,28462635.850000001]
[542,1,1,50225,0,0,50225,1.056E-2,50206.84,418389.06,0,0,418389.06,8.7999999999999995E-2,418390.3,468614.06,0,0,468614.06,9.8559999999999995E-2,468597.14]
[543,1,0,0,0,0,0,0,0,0,0,0,0,0,0,0,0,0,0,0,0]
[544,1,1,0,0,0,0,0,0,2096591.58,0,0,2096591.58,0.15457000000000001,2096548.49,2096591.58,0,0,2096591.58,0.15457000000000001,2096548.49]
[545,1,1,264273.39,0,0,264273.39,0.12975999999999999,264265.7,208766.43,0,0,208766.43,0.10251,208769.09,473039.82,0,0,473039.82,0.23227,473034.79]
[547,1,1,248839.63,0,0,248839.63,0.13507,248842.84,241575.7,0,0,241575.7,0.13113,241584.08,490415.33,0,0,490415.33,0.26619999999999999,490426.92]
[548,1,1,0,0,0,0,0,0,701942.24,0,0,701942.24,0.11706999999999999,701942.05,701942.24,0,0,701942.24,0.11706999999999999,701942.05]
[549,1,1,0,0,0,0,0,0,1288928.77,0,0,1288928.77,0.12232,1288901.22,1288928.77,0,0,1288928.77,0.12232,1288901.22]
[550,1,1,0,0,0,0,0,0,104046.31,0,0,104046.31,6.0150000000000002E-2,104047.69,104046.31,0,0,104046.31,6.0150000000000002E-2,104047.69]
[553,1,1,0,0,0,0,0,0,294970.78999999998,0,0,294970.78999999998,0.15540000000000001,294979.83,294970.78999999998,0,0,294970.78999999998,0.15540000000000001,294979.83]
[561,1,1,207598.4,0,0,207598.4,0.66149000000000002,207598.71,37701.58,0,0,37701.58,0.12013,37701,245299.98,0,0,245299.98,0.78161999999999998,245299.71]
[564,1,1,411186.39,0,0,411186.39,4.8390000000000002E-2,411187.78,920392.74,0,0,920392.74,0.10832,920435.23,1331579.1299999999,0,0,1331579.1299999999,0.15670999999999999,1331623.01]
[566,1,0,0,0,0,0,0,0,0,0,0,0,0,0,0,0,0,0,0,0]
[570,1,0,0,0,0,0,0,0,0,0,0,0,0,0,0,0,0,0,0,0]
[573,1,0,0,0,0,0,0,0,0,0,0,0,0,0,0,0,0,0,0,0]
[576,1,0,0,0,0,0,0,0,0,0,0,0,0,0,0,0,0,0,0,0]
[577,1,1,0,0,0,0,0,0,253073.72,0,0,253073.72,0.13764999999999999,253068.97,253073.72,0,0,253073.72,0.13764999999999999,253068.97]
[578,1,1,395364.12,0,0,395364.12,6.2780000000000002E-2,395366.3,662927.44999999995,0,0,662927.44999999995,0.10527,662953.32999999996,1058291.57,0,0,1058291.57,0.16805,1058319.6299999999]
[581,1,1,149903.26,0,0,149903.26,0.13389000000000001,149905.39000000001,197671.03,0,0,197671.03,0.17657,197690.6,347574.29,0,0,347574.29,0.31046000000000001,347595.99]
[582,1,0,0,0,0,0,0,0,0,0,0,0,0,0,0,0,0,0,0,0]
[583,1,0,0,0,0,0,0,0,0,0,0,0,0,0,0,0,0,0,0,0]
[584,1,0,0,0,0,0,0,0,0,0,0,0,0,0,0,0,0,0,0,0]
[592,1,1,98325.26,0,0,98325.26,0.35931000000000002,98325,40265.879999999997,0,0,40265.879999999997,0.14713999999999999,40266,138591.14000000001,0,0,138591.14000000001,0.50644999999999996,138591]
[593,1,1,787088.69,0,0,787088.69,0.17677999999999999,787089.44,505165.51,0,0,505165.51,0.11346000000000001,505164.98,1292254.2,0,0,1292254.2,0.29024,1292254.42]
[595,1,1,178108.05,0,0,178108.05,2.3869999999999999E-2,178107.94,1018428.95,0,0,1018428.95,0.13650000000000001,1018428.98,1196537,0,0,1196537,0.16037000000000001,1196536.92]
[597,1,0,0,0,0,0,0,0,0,0,0,0,0,0,0,0,0,0,0,0]
[599,1,1,221902.24,0,0,221902.24,0.13764999999999999,221902,197482.08,0,0,197482.08,0.1225,197481.99,419384.32000000001,0,0,419384.32000000001,0.26014999999999999,419383.99]
[600,1,1,50125.91,0,0,50125.91,8.4959999999999994E-2,50126,131022.84,0,0,131022.84,0.22206000000000001,131023,181148.75,0,0,181148.75,0.30702000000000002,181149]
[601,1,1,211320.07,0,0,211320.07,0.11840000000000001,211314.28,218566.65,0,0,218566.65,0.12246,218560.36,429886.71999999997,0,0,429886.71999999997,0.24085999999999999,429874.64]
[603,1,0,0,0,0,0,0,0,0,0,0,0,0,0,0,0,0,0,0,0]
[604,1,0,0,0,0,0,0,0,0,0,0,0,0,0,0,0,0,0,0,0]
[611,1,0,0,0,0,0,0,0,0,0,0,0,0,0,0,0,0,0,0,0]
[612,1,0,0,0,0,0,0,0,0,0,0,0,0,0,0,0,0,0,0,0]
[614,1,0,0,0,0,0,0,0,0,0,0,0,0,0,0,0,0,0,0,0]
[615,1,0,0,0,0,0,0,0,0,0,0,0,0,0,0,0,0,0,0,0]
[621,1,1,13291701,0,-1495434,11796267,0.13478000000000001,11796266.27,7134541,0,-802699,6331842,7.2340000000000002E-2,6331841.2800000003,20426242,0,-2298133,18128109,0.20712,18128107.550000001]
[622,1,1,12013188,0,-1207082,10806106,0.14477999999999999,10806105.810000001,5901292,0,-592960,5308332,7.1120000000000003E-2,5308331.84,17914480,0,-1800042,16114438,0.21590000000000001,16114437.65]
[623,1,1,8514198,0,-1027665,7486533,0.13120999999999999,7486532.6600000001,4041997,0,-487870,3554127,6.2289999999999998E-2,3554126.83,12556195,0,-1515535,11040660,0.19350000000000001,11040659.49]
[624,1,1,12996407,0,-1357867,11638540,0.16857,11638539.699999999,4732729,0,-494476,4238253,6.139E-2,4238252.96,17729136,0,-1852343,15876793,0.22996,15876792.66]
[625,1,1,17366461,0,-3694235,13672226,6.2710000000000002E-2,13672224.949999999,20492159,0,-4359141,16133018,7.399E-2,16133015.65,37858620,0,-8053376,29805244,0.13669999999999999,29805240.600000001]
[627,1,0,0,0,0,0,0,0,0,0,0,0,0,0,0,0,0,0,0,0]
[628,1,0,0,0,0,0,0,0,0,0,0,0,0,0,0,0,0,0,0,0]
[630,1,1,445034,0,0,445034,0.51214999999999999,445040.94,74591,0,0,74591,8.584E-2,74592.039999999994,519625,0,0,519625,0.59799000000000002,519632.98]
[631,1,0,0,0,0,0,0,0,0,0,0,0,0,0,0,0,0,0,0,0]
[633,1,0,0,0,0,0,0,0,0,0,0,0,0,0,0,0,0,0,0,0]
[635,1,1,128904,0,0,128904,0.32068999999999998,128911.29,14188,0,0,14188,3.5299999999999998E-2,14189.93,143092,0,0,143092,0.35598999999999997,143101.22]
[636,1,0,0,0,0,0,0,0,0,0,0,0,0,0,0,0,0,0,0,0]
[637,1,0,0,0,0,0,0,0,0,0,0,0,0,0,0,0,0,0,0,0]
[638,1,0,0,0,0,0,0,0,0,0,0,0,0,0,0,0,0,0,0,0]
[640,1,1,129986,0,0,129986,0.10691000000000001,129987.7,157374,0,0,157374,0.12945000000000001,157393.21,287360,0,0,287360,0.23635999999999999,287380.90999999997]
[641,1,0,0,0,0,0,0,0,0,0,0,0,0,0,0,0,0,0,0,0]
[646,1,0,0,0,0,0,0,0,0,0,0,0,0,0,0,0,0,0,0,0]
[647,1,0,0,0,0,0,0,0,0,0,0,0,0,0,0,0,0,0,0,0]
[648,1,0,0,0,0,0,0,0,0,0,0,0,0,0,0,0,0,0,0,0]
[649,1,0,0,0,0,0,0,0,0,0,0,0,0,0,0,0,0,0,0,0]
[650,1,0,0,0,0,0,0,0,0,0,0,0,0,0,0,0,0,0,0,0]
[651,1,0,0,0,0,0,0,0,0,0,0,0,0,0,0,0,0,0,0,0]
[652,1,0,0,0,0,0,0,0,0,0,0,0,0,0,0,0,0,0,0,0]
[653,1,0,0,0,0,0,0,0,0,0,0,0,0,0,0,0,0,0,0,0]
[654,1,0,0,0,0,0,0,0,0,0,0,0,0,0,0,0,0,0,0,0]
[655,1,0,0,0,0,0,0,0,0,0,0,0,0,0,0,0,0,0,0,0]
[656,1,1,1721547.54,0,0,1721547.54,8.8270000000000001E-2,1721514.63,1619251.69,0,0,1619251.69,8.3030000000000007E-2,1619319.81,3340799.23,0,0,3340799.23,0.17130000000000001,3340834.44]
[657,1,0,0,0,0,0,0,0,0,0,0,0,0,0,0,0,0,0,0,0]
[659,1,1,5404759.5899999999,0,-18851.28,5385908.3099999996,0.24990999999999999,5385871.1900000004,2008002.68,0,-7003.72,2000998.96,9.2850000000000002E-2,2001032.93,7412762.2699999996,0,-25855,7386907.2699999996,0.34276000000000001,7386904.1200000001]
[669,1,0,0,0,0,0,0,0,0,0,0,0,0,0,0,0,0,0,0,0]
[670,1,0,0,0,0,0,0,0,0,0,0,0,0,0,0,0,0,0,0,0]
[671,1,1,269006,0,0,269006,0.26988000000000001,269022.86,101853,0,0,101853,0.10218000000000001,101855.48,370859,0,0,370859,0.37206,370878.34]
[676,1,1,125598,0,0,125598,0.32002999999999998,125599.93,41352,0,0,41352,0.10537000000000001,41353.83,166950,0,0,166950,0.4254,166953.76]
[678,1,0,0,0,0,0,0,0,0,0,0,0,0,0,0,0,0,0,0,0]
[682,1,1,137628,0,0,137628,3.687E-2,137631.51,463162,0,0,463162,0.12408,463176.49,600790,0,0,600790,0.16095000000000001,600808]
[690,1,1,99581,0,0,99581,3.116E-2,99572.12,322460,0,0,322460,0.10091,322459.02,422041,0,0,422041,0.13206999999999999,422031.14]
[691,1,0,0,0,0,0,0,0,0,0,0,0,0,0,0,0,0,0,0,0]
[692,1,0,0,0,0,0,0,0,0,0,0,0,0,0,0,0,0,0,0,0]
[693,1,0,0,0,0,0,0,0,0,0,0,0,0,0,0,0,0,0,0,0]
[695,1,1,81273.7,0,0,81273.7,4.1209999999999997E-2,81270.350000000006,252332.04,0,0,252332.04,0.12795000000000001,252330.53,333605.74,0,0,333605.74,0.16916,333600.88]
[696,1,1,159157.9,0,0,159157.9,4.2599999999999999E-2,159163.42000000001,484559.47,0,0,484559.47,0.12969,484551.73,643717.37,0,0,643717.37,0.17229,643715.15]
[697,1,0,0,0,0,0,0,0,0,0,0,0,0,0,0,0,0,0,0,0]
[698,1,1,0,0,0,0,0,0,239760.29,0,0,239760.29,9.3689999999999996E-2,239771.67,239760.29,0,0,239760.29,9.3689999999999996E-2,239771.67]
[699,1,0,0,0,0,0,0,0,0,0,0,0,0,0,0,0,0,0,0,0]
[700,1,1,0,0,0,0,0,0,1726565.95,0,0,1726565.95,0.14485999999999999,1726533.99,1726565.95,0,0,1726565.95,0.14485999999999999,1726533.99]
[701,1,1,0,0,0,0,0,0,1210720.8400000001,0,0,1210720.8400000001,0.14057,1210753.6399999999,1210720.8400000001,0,0,1210720.8400000001,0.14057,1210753.6399999999]
[704,1,1,0,0,0,0,0,0,1427073.18,0,0,1427073.18,0.14509,1427042.18,1427073.18,0,0,1427073.18,0.14509,1427042.18]
[706,1,1,248754.46,0,0,248754.46,4.9099999999999998E-2,248779.22,755972.51,0,0,755972.51,0.1492,755964.54,1004726.97,0,0,1004726.97,0.1983,1004743.76]
[707,1,1,0,0,0,0,0,0,147.99,0,0,147.99,0.14918000000000001,147.99,147.99,0,0,147.99,0.14918000000000001,147.99]
[708,1,0,0,0,0,0,0,0,0,0,0,0,0,0,0,0,0,0,0,0]
[709,1,1,2807140.86,0,0,2807140.86,4.1610000000000001E-2,2807307.16,4503089.75,0,0,4503089.75,6.6739999999999994E-2,4502756.0599999996,7310230.6100000003,0,0,7310230.6100000003,0.10835,7310063.2199999997]
[710,1,0,0,0,0,0,0,0,0,0,0,0,0,0,0,0,0,0,0,0]
[712,1,1,38899.800000000003,0,0,38899.800000000003,1.332E-2,38892.660000000003,0,0,0,0,0,0,38899.800000000003,0,0,38899.800000000003,1.332E-2,38892.660000000003]
[716,1,1,0,0,0,0,0,0,1001249,0,-130627,870622,0.11595,870621.95,1001249,0,-130627,870622,0.11595,870621.95]
[717,1,1,0,0,0,0,0,0,1343435,0,-171111,1172324,0.12452000000000001,1172323.95,1343435,0,-171111,1172324,0.12452000000000001,1172323.95]
[719,1,1,5159411,0,-424286,4735125,9.6229999999999996E-2,4735124.62,5794711,0,-476530,5318181,0.10808,5318180.67,10954122,0,-900816,10053306,0.20430999999999999,10053305.289999999]
[720,1,1,0,0,0,0,0,0,5991217,0,-703983,5287234,0.11477,5287233.71,5991217,0,-703983,5287234,0.11477,5287233.71]
[721,1,1,752326,0,-19148,733178,3.9739999999999998E-2,733177.85,2781630,0,-70798,2710832,0.14693999999999999,2710831.91,3533956,0,-89946,3444010,0.18668000000000001,3444009.76]
[726,1,1,2453186.7400000002,0,0,2453186.7400000002,0.15695000000000001,2453165.35,1725781.57,0,0,1725781.57,0.11040999999999999,1725734.22,4178968.31,0,0,4178968.31,0.26735999999999999,4178899.57]
[727,1,1,1317586.53,0,0,1317586.53,0.10086000000000001,1317642.19,1353955.75,0,0,1353955.75,0.10364,1353960.3,2671542.2799999998,0,0,2671542.2799999998,0.20449999999999999,2671602.4900000002]
[728,1,1,7064000.5300000003,0,-184930.46,6879070.0700000003,0.10381,6878850.1399999997,6118300.6600000001,0,-160172.72,5958127.9400000004,8.992E-2,5958445.2800000003,13182301.189999999,0,-345103.18,12837198.01,0.19373000000000001,12837295.42]
[731,1,0,0,0,0,0,0,0,0,0,0,0,0,0,0,0,0,0,0,0]
[732,1,0,0,0,0,0,0,0,0,0,0,0,0,0,0,0,0,0,0,0]
[733,1,0,0,0,0,0,0,0,0,0,0,0,0,0,0,0,0,0,0,0]
[734,1,0,0,0,0,0,0,0,0,0,0,0,0,0,0,0,0,0,0,0]
[735,1,0,0,0,0,0,0,0,0,0,0,0,0,0,0,0,0,0,0,0]
[736,1,0,0,0,0,0,0,0,0,0,0,0,0,0,0,0,0,0,0,0]
[737,1,0,0,0,0,0,0,0,0,0,0,0,0,0,0,0,0,0,0,0]
[738,1,1,3312,0,0,3312,1.0499999999999999E-3,3311.99,640673,0,0,640673,0.20313000000000001,640672.98,643985,0,0,643985,0.20418,643984.97]
[739,1,1,383359,0,0,383359,0.11940000000000001,383358.99,349738,0,0,349738,0.10893,349737.99,733097,0,0,733097,0.22833000000000001,733096.98]
[740,1,1,211942,0,0,211942,3.8739999999999997E-2,211941.95,616299,0,0,616299,0.11266,616298.96,828241,0,0,828241,0.15140000000000001,828240.91]
[741,1,1,187618,0,0,187618,4.3560000000000001E-2,187617.98,496081,0,0,496081,0.11516999999999999,496080.99,683699,0,0,683699,0.15873000000000001,683698.97]
[742,1,1,80703,0,0,80703,1.2899999999999999E-3,80702.73,7194923,0,0,7194923,0.11481,7194922.4100000001,7275626,0,0,7275626,0.11609999999999999,7275625.1399999997]
[743,1,1,844174,0,0,844174,0.1542,844173.99,599420,0,0,599420,0.10949,599419.98,1443594,0,0,1443594,0.26368999999999998,1443593.97]
[745,1,1,0,0,0,0,0,0,995643,0,0,995643,0.14677000000000001,995642.99,995643,0,0,995643,0.14677000000000001,995642.99]
[748,1,1,536987,0,0,536987,3.7920000000000002E-2,536986.96,1480510,0,0,1480510,0.10456,1480510,2017497,0,0,2017497,0.14248,2017496.96]
[750,1,1,0,0,0,0,0,0,1777322,0,0,1777322,0.16903000000000001,1777321.96,1777322,0,0,1777322,0.16903000000000001,1777321.96]
[756,1,1,98221,0,0,98221,4.3119999999999999E-2,98223.52,251815,0,0,251815,0.11055,251823.06,350036,0,0,350036,0.15367,350046.58]
[761,1,1,2154028,0,0,2154028,0.10595,2154062.25,2194940,0,0,2194940,0.10797,2195130.73,4348968,0,0,4348968,0.21392,4349192.9800000004]
[762,1,0,0,0,0,0,0,0,0,0,0,0,0,0,0,0,0,0,0,0]
[763,1,1,0,0,0,0,0,0,482506,0,0,482506,0.21698999999999999,482509.6,482506,0,0,482506,0.21698999999999999,482509.6]
[768,1,1,97724.97,0,0,97724.97,0.16943,97729.26,95376.36,0,0,95376.36,0.16536000000000001,95381.63,193101.33,0,0,193101.33,0.33478999999999998,193110.89]
[769,1,0,0,0,0,0,0,0,0,0,0,0,0,0,0,0,0,0,0,0]
[771,1,1,330226.65999999997,0,0,330226.65999999997,0.54879,330235.48,32962.76,0,0,32962.76,5.4780000000000002E-2,32963.97,363189.42,0,0,363189.42,0.60357000000000005,363199.45]
[775,1,1,0,0,0,0,0,0,296923,0,0,296923,0.21448,296929.53999999998,296923,0,0,296923,0.21448,296929.53999999998]
[777,1,1,450761,0,0,450761,0.13389000000000001,450803.88,348054,0,0,348054,0.10338,348077.57,798815,0,0,798815,0.23727000000000001,798881.45]
[784,1,0,0,0,0,0,0,0,0,0,0,0,0,0,0,0,0,0,0,0]
[786,1,1,110650.35,0,0,110650.35,0.16506000000000001,110652.43,94803.01,0,0,94803.01,0.14141999999999999,94804.72,205453.36,0,0,205453.36,0.30647999999999997,205457.15]
[787,1,1,0,0,0,0,0,0,195248.16,0,0,195248.16,0.20774999999999999,195262.56,195248.16,0,0,195248.16,0.20774999999999999,195262.56]
[789,1,0,0,0,0,0,0,0,0,0,0,0,0,0,0,0,0,0,0,0]
[790,1,0,0,0,0,0,0,0,0,0,0,0,0,0,0,0,0,0,0,0]
[791,1,0,0,0,0,0,0,0,0,0,0,0,0,0,0,0,0,0,0,0]
[792,1,0,0,0,0,0,0,0,0,0,0,0,0,0,0,0,0,0,0,0]
[793,1,0,0,0,0,0,0,0,0,0,0,0,0,0,0,0,0,0,0,0]
[801,1,1,70731.62,0.38,0,70732,0.34572999999999998,70735.67,33680.22,-0.22,0,33680,0.16461999999999999,33680.92,104411.84,0.16,0,104412,0.51034999999999997,104416.59]
[803,1,1,233637.16,-0.16,0,233637,0.24374000000000001,233651.85,117715.03,-0.03,0,117715,0.12280000000000001,117717.43,351352.19,-0.19,0,351352,0.36653999999999998,351369.28]
[806,1,0,0,0,0,0,0,0,0,0,0,0,0,0,0,0,0,0,0,0]
[809,1,0,0,0,0,0,0,0,0,0,0,0,0,0,0,0,0,0,0,0]
[810,1,0,0,0,0,0,0,0,0,0,0,0,0,0,0,0,0,0,0,0]
[811,1,1,640366,0,0,640366,0.14246,640370.52,67394,0,0,67394,1.499E-2,67381.399999999994,707760,0,0,707760,0.15745000000000001,707751.92]
[813,1,1,1207113,0,0,1207113,0.16597000000000001,1207109.23,162956,0,0,162956,2.2409999999999999E-2,162989.20000000001,1370069,0,0,1370069,0.18837999999999999,1370098.43]
[815,2,1,14991.45,0,0,14991.45,3.5000000000000003E-2,14996.66,327.49,0,0,327.49,7.6999999999999996E-4,329.93,15318.94,0,0,15318.94,3.5770000000000003E-2,15326.59]
[818,1,1,30871,0,0,30871,3.9199999999999999E-2,30878.11,54565,0,0,54565,6.9279999999999994E-2,54572.34,85436,0,0,85436,0.10847999999999999,85450.45]
[819,1,0,0,0,0,0,0,0,0,0,0,0,0,0,0,0,0,0,0,0]
[820,1,1,83699,0,0,83699,6.8129999999999996E-2,83710.240000000005,157330,0,0,157330,0.12805,157332.99,241029,0,0,241029,0.19617999999999999,241043.23]
[821,1,1,0,0,0,0,0,0,320357,0,0,320357,0.17348,320368.81,320357,0,0,320357,0.17348,320368.81]
[827,1,0,0,0,0,0,0,0,0,0,0,0,0,0,0,0,0,0,0,0]
[829,1,1,287215,0,0,287215,4.0800000000000003E-2,287187.52,729904,0,0,729904,0.1037,729934.94,1017119,0,0,1017119,0.14449999999999999,1017122.46]
[830,1,0,0,0,0,0,0,0,0,0,0,0,0,0,0,0,0,0,0,0]
[831,1,1,2660046,0,-280120,2379926,5.0930000000000003E-2,2379925.77,4059169,0,-427457,3631712,7.7719999999999997E-2,3631711.93,6719215,0,-707577,6011638,0.12864999999999999,6011637.7000000002]
[832,1,1,2664085,0,-162992,2501093,0.12046,2501092.5499999998,2948322,0,-180383,2767939,0.13331000000000001,2767939.31,5612407,0,-343375,5269032,0.25377,5269031.8600000003]
[833,1,1,25203421,0,-3145741,22057680,0.22853000000000001,22057679.710000001,9295122,0,-1160162,8134960,8.4279999999999994E-2,8134959.0800000001,34498543,0,-4305903,30192640,0.31280999999999998,30192638.789999999]
[834,1,1,10668898,0,-754236,9914662,0.11681,9914661.9499999993,7145012,0,-505116,6639896,7.8229999999999994E-2,6639895.8700000001,17813910,0,-1259352,16554558,0.19503999999999999,16554557.82]
[836,1,1,203027.56,0,0,203027.56,0.47315000000000002,203027.88,57790.44,0,0,57790.44,0.13467999999999999,57790.97,260818,0,0,260818,0.60782999999999998,260818.85]
[837,1,1,292667.34999999998,0,0,292667.34999999998,0.18382999999999999,292661.53999999998,177666.81,0,0,177666.81,0.1116,177669.74,470334.16,0,0,470334.16,0.29543000000000003,470331.28]
[840,1,1,358889.44,0,0,358889.44,0.14266999999999999,358884.59,248324.87,0,0,248324.87,9.8720000000000002E-2,248328.92,607214.31000000006,0,0,607214.31000000006,0.24138999999999999,607213.51]
[846,1,1,348965.14,0,0,348965.14,0.13655,348998.31,260245.5,0,0,260245.5,0.10183,260259.97,609210.64,0,0,609210.64,0.23838000000000001,609258.28]
[850,1,1,72125.84,0,0,72125.84,0.10496999999999999,72135.59,33912.65,0,0,33912.65,4.9349999999999998E-2,33913.42,106038.49,0,0,106038.49,0.15432000000000001,106049.01]
[852,1,1,201581.67,0,0,201581.67,0.47559000000000001,201588.81,63797.09,0,0,63797.09,0.15051999999999999,63801.06,265378.76,0,0,265378.76,0.62611000000000006,265389.87]
[857,1,1,140268.29999999999,0,0,140268.29999999999,5.7189999999999998E-2,140270.35999999999,367674.99,0,0,367674.99,0.14990999999999999,367685.42,507943.29,0,0,507943.29,0.20710000000000001,507955.78]
[858,1,1,1042.6600000000001,0,0,1042.6600000000001,2.7999999999999998E-4,1042.33,526793.51,0,0,526793.51,0.14151,526787.53,527836.17000000004,0,0,527836.17000000004,0.14179,527829.86]
[861,1,1,4776559.2699999996,0,0,4776559.2699999996,0.19167000000000001,4776481.3600000003,1632059.75,0,0,1632059.75,6.5490000000000007E-2,1632032.99,6408619.0199999996,0,0,6408619.0199999996,0.25716,6408514.3499999996]
[876,1,1,371789,0,0,371789,3.8670000000000003E-2,371801.96,1119474,0,0,1119474,0.11643000000000001,1119444.06,1491263,0,0,1491263,0.15509999999999999,1491246.02]
[877,1,1,319534,0,-4082,315452,1.1390000000000001E-2,315489.84999999998,3134312,0,-40033,3094279,0.11171,3094238.06,3453846,0,-44115,3409731,0.1231,3409727.91]
[879,1,1,942318,0,-16430,925888,7.2539999999999993E-2,925902.16,1846119,0,-32188,1813931,0.14210999999999999,1813895.17,2788437,0,-48618,2739819,0.21465000000000001,2739797.33]
[880,1,0,0,0,0,0,0,0,0,0,0,0,0,0,0,0,0,0,0,0]
[881,1,1,0,0,0,0,0,0,609830,0,0,609830,0.14463000000000001,609843.53,609830,0,0,609830,0.14463000000000001,609843.53]
[882,1,1,2917574,0,0,2917574,0.11524,2917557.1,2457019,0,0,2457019,9.7049999999999997E-2,2457036.7599999998,5374593,0,0,5374593,0.21229000000000001,5374593.8600000003]
[883,1,1,0,0,0,0,0,0,1363563,0,-54600,1308963,0.13877,1308973.73,1363563,0,-54600,1308963,0.13877,1308973.73]
[885,1,1,746385,0,0,746385,3.925E-2,746370.47,2344151,0,0,2344151,0.12327,2344078.6800000002,3090536,0,0,3090536,0.16252,3090449.15]
[891,1,1,295394.18,0,0,295394.18,0.19384000000000001,295392.77,166969.78,0,0,166969.78,0.10957,166973.72,462363.96,0,0,462363.96,0.30341000000000001,462366.49]
[892,1,0,0,0,0,0,0,0,0,0,0,0,0,0,0,0,0,0,0,0]
[893,1,0,0,0,0,0,0,0,0,0,0,0,0,0,0,0,0,0,0,0]
[894,1,0,0,0,0,0,0,0,0,0,0,0,0,0,0,0,0,0,0,0]
[896,1,0,0,0,0,0,0,0,0,0,0,0,0,0,0,0,0,0,0,0]
[911,1,1,0,0,0,0,0,0,2745610,0,0,2745610,0.14198,2745609.92,2745610,0,0,2745610,0.14198,2745609.92]
[912,1,1,0,0,0,0,0,0,780492,0,0,780492,0.12964000000000001,780572.94,780492,0,0,780492,0.12964000000000001,780572.94]
[913,1,0,0,0,0,0,0,0,0,0,0,0,0,0,0,0,0,0,0,0]
[914,1,1,396112.27,0,0,396112.27,0.45074999999999998,396112,88270.8,0,0,88270.8,0.10045,88271,484383.07,0,0,484383.07,0.55120000000000002,484383]
[916,6,0,0,0,0,0,0,0,0,0,0,0,0,0,0,0,0,0,0,0]
[917,6,0,0,0,0,0,0,0,0,0,0,0,0,0,0,0,0,0,0,0]
[918,1,0,0,0,0,0,0,0,0,0,0,0,0,0,0,0,0,0,0,0]
[2071,1,1,26655.9,0,0,26655.9,5.79E-3,26678.75,523131.14,0,0,523131.14,0.11354,523161.44,549787.04,0,0,549787.04,0.11933000000000001,549840.18999999994]
[2125,1,1,805,0,0,805,2.1000000000000001E-4,810.84,488333,0,0,488333,0.12647,488320.6,489138,0,0,489138,0.12667999999999999,489131.44]
[2134,1,1,889775.02,0,0,889775.02,0.33343,889777.43,210652.71,0,0,210652.71,7.8939999999999996E-2,210656,1100427.73,0,0,1100427.73,0.41237000000000001,1100433.43]
[2135,1,1,139174.37,0,0,139174.37,4.4200000000000003E-2,139171.74,451779.77,0,0,451779.77,0.14348,451772.89,590954.14,0,0,590954.14,0.18768000000000001,590944.63]
[2137,1,1,137581.20000000001,0,0,137581.20000000001,4.8869999999999997E-2,137580.70000000001,258725.48,-33.229999999999997,0,258692.25,9.1889999999999999E-2,258692.25,396306.68,-33.229999999999997,0,396273.45,0.14076,396272.95]
[2142,1,1,0,0,0,0,0,0,1562461.52,0,0,1562461.52,0.10705000000000001,1562464.85,1562461.52,0,0,1562461.52,0.10705000000000001,1562464.85]
[2143,1,1,899374.26,0,0,899374.26,0.18532000000000001,899369.22,572947.44999999995,0,0,572947.44999999995,0.11806,572952.35,1472321.71,0,0,1472321.71,0.30337999999999998,1472321.57]
[2144,1,1,755604.58,0,-1642,753962.58,3.9730000000000001E-2,753963.38,2525840.06,0,-5487,2520353.06,0.13281999999999999,2520352.48,3281444.64,0,-7129,3274315.64,0.17255000000000001,3274315.86]
[2148,1,0,0,0,0,0,0,0,0,0,0,0,0,0,0,0,0,0,0,0]
[2149,1,1,388138,0,0,388138,5.5010000000000003E-2,388186.21,786520,0,0,786520,0.11146,786533.99,1174658,0,0,1174658,0.16647000000000001,1174720.2]
[2153,1,0,0,0,0,0,0,0,0,0,0,0,0,0,0,0,0,0,0,0]
[2154,1,1,171314.52,0,-26138.42,145176.1,3.5189999999999999E-2,145187.26999999999,398224.55,0,-60759.360000000001,337465.19,8.1799999999999998E-2,337491.3,569539.06999999995,0,-86897.78,482641.29,0.11699,482678.57]
[2155,1,1,181401,0,0,181401,5.3530000000000001E-2,181420.36,271526,0,0,271526,8.0119999999999997E-2,271537.45,452927,0,0,452927,0.13364999999999999,452957.81]
[2159,1,1,368443.49,0,0,368443.49,0.16849,368473.48,211813.33,0,0,211813.33,9.6860000000000002E-2,211824.68,580256.81999999995,0,0,580256.81999999995,0.26534999999999997,580298.16]
[2163,1,0,0,0,0,0,0,0,0,0,0,0,0,0,0,0,0,0,0,0]
[2164,1,1,8887.7199999999993,0,0,8887.7199999999993,2.2300000000000002E-3,8887.9699999999993,966775.02,0,0,966775.02,0.24221000000000001,966774.98,975662.74,0,0,975662.74,0.24443999999999999,975662.95]
[2165,1,1,1626.98,0,0,1626.98,4.0000000000000002E-4,1611.56,545826.80000000005,0,0,545826.80000000005,0.13547999999999999,545835.97,547453.78,0,0,547453.78,0.13588,547447.53]
[2167,1,1,70513,0,0,70513,4.1430000000000002E-2,70521.69,213403,0,0,213403,0.12537000000000001,213403.43,283916,0,0,283916,0.1668,283925.12]
[2168,1,1,0,0,0,0,0,0,560362,0,0,560362,0.17891000000000001,560362.18999999994,560362,0,0,560362,0.17891000000000001,560362.18999999994]
[2169,1,1,522803.52,0,0,522803.52,0.21226,522810.6,261363.84,0,0,261363.84,0.10612000000000001,261380.67,784167.36,0,0,784167.36,0.31838,784191.27]
[2170,1,1,46848,0,0,46848,9.1500000000000001E-3,46884.54,606969,0,0,606969,0.11846,606988.23,653817,0,0,653817,0.12761,653872.77]
[2171,1,1,604932,0,0,604932,0.22864999999999999,604936.56000000006,14261,0,0,14261,5.3899999999999998E-3,14260.26,619193,0,0,619193,0.23404,619196.81999999995]
[2172,1,1,305045.53999999998,0.46,0,305046,8.0680000000000002E-2,305044.2,361236,0,0,361236,9.554E-2,361228.6,666281.54,0.46,0,666282,0.17621999999999999,666272.80000000005]
[2174,1,1,0,0,0,0,0,0,730284.68,0,0,730284.68,0.12989000000000001,730274.63,730284.68,0,0,730284.68,0.12989000000000001,730274.63]
[2176,1,1,635586.86,0,0,635586.86,0.34442,635596.11,141949.74,0,0,141949.74,7.6929999999999998E-2,141967.39000000001,777536.6,0,0,777536.6,0.42135,777563.5]
[2180,1,1,680485.81,0,0,680485.81,0.28658,680496.06,281379.65999999997,0,0,281379.65999999997,0.11849999999999999,281383.15000000002,961865.47,0,0,961865.47,0.40508,961879.21]
[2183,1,0,0,0,0,0,0,0,0,0,0,0,0,0,0,0,0,0,0,0]
[2184,1,1,430376,0,0,430376,0.11351,430391.21,400989,0,0,400989,0.10576000000000001,401005.86,831365,0,0,831365,0.21926999999999999,831397.07]
[2190,1,1,733419.31,0,0,733419.31,0.19689000000000001,733418.58,257309.88,0,0,257309.88,6.9080000000000003E-2,257324.17,990729.19,0,0,990729.19,0.26596999999999998,990742.75]
[2198,1,1,269912.84000000003,-92.57,0,269820.27,9.8199999999999996E-2,269820.27,372652.95,-125.13,0,372527.82,0.13558000000000001,372527.82,642565.79,-217.7,0,642348.09,0.23377999999999999,642348.09]
[2215,1,1,264129.78999999998,0,0,264129.78999999998,0.35626000000000002,264143.28000000003,53025.93,0,0,53025.93,7.152E-2,53027.360000000001,317155.71999999997,0,0,317155.71999999997,0.42777999999999999,317170.64]
[2310,1,1,100609,0,0,100609,2.3939999999999999E-2,100621.57,483060.68,0,0,483060.68,0.11493,483059.17,583669.68000000005,0,0,583669.68000000005,0.13886999999999999,583680.74]
[2311,1,1,173714,0,0,173714,4.2770000000000002E-2,173724.9,383029,0,0,383029,9.4299999999999995E-2,383031.51,556743,0,0,556743,0.13707,556756.41]
[2342,1,1,1163558.5900000001,0,0,1163558.5900000001,0.43358999999999998,1163573.02,249375.03,0,0,249375.03,9.2929999999999999E-2,249385,1412933.62,0,0,1412933.62,0.52651999999999999,1412958.02]
[2358,1,1,408146,0,0,408146,0.53332999999999997,408146.41,46669,0,0,46669,6.0979999999999999E-2,46666.73,454815,0,0,454815,0.59431,454813.14]
[2359,1,0,0,0,0,0,0,0,0,0,0,0,0,0,0,0,0,0,0,0]
[2364,1,1,158762,0,0,158762,6.8510000000000001E-2,158761.99,255336,0,0,255336,0.11018,255336,414098,0,0,414098,0.17868999999999999,414097.99]
[2365,1,1,199396.16,0,0,199396.16,6.1870000000000001E-2,199382.11,276122.15999999997,0,0,276122.15999999997,8.5680000000000006E-2,276112.15000000002,475518.32,0,0,475518.32,0.14754999999999999,475494.26]
[2396,1,1,317638.13,0,0,317638.13,9.0660000000000004E-2,317651.06,427264.86,0,0,427264.86,0.12195,427283.78,744902.99,0,0,744902.99,0.21260999999999999,744934.84]
[2397,1,1,304738.32,0,-76.19,304662.13,5.7840000000000003E-2,304663.78000000003,551161.87,0,-137.81,551024.06000000006,0.10460999999999999,551017.94999999995,855900.19,0,-214,855686.19,0.16245000000000001,855681.73]
[2448,1,1,525502.61,0,0,525502.61,0.17072000000000001,525489.05000000005,364936.82,0,0,364936.82,0.11856,364936.63,890439.43,0,0,890439.43,0.28927999999999998,890425.68]
[2527,1,1,145456.97,0,0,145456.97,0.27689000000000002,145460.01,54214.65,0,0,54214.65,0.10321,54219.83,199671.62,0,0,199671.62,0.38009999999999999,199679.84]
[2534,1,1,102837.61,0,0,102837.61,3.8109999999999998E-2,102858.09,294351.01,0,0,294351.01,0.10908,294404.63,397188.62,0,0,397188.62,0.14718999999999999,397262.72]
[2536,1,1,621972.43999999994,0,0,621972.43999999994,0.73307999999999995,621974.36,73934.460000000006,0,0,73934.460000000006,8.7139999999999995E-2,73933.06,695906.9,0,0,695906.9,0.82021999999999995,695907.42]
[2580,1,1,0,0,0,0,0,0,276585.65999999997,0,0,276585.65999999997,0.10374,276578.38,276585.65999999997,0,0,276585.65999999997,0.10374,276578.38]
[2609,1,1,209904.61,0,0,209904.61,0.12109,209904.99,181997.29,0,0,181997.29,0.10499,181996.99,391901.9,0,0,391901.9,0.22608,391901.98]
[2683,1,1,125368,0,0,125368,0.12167,125364.87,96115,0,0,96115,9.3280000000000002E-2,96112.73,221483,0,0,221483,0.21495,221477.6]
[2687,1,1,252539,0,-52,252487,3.8620000000000002E-2,252509.03,609061,0,-126,608935,9.3130000000000004E-2,608911.6,861600,0,-178,861422,0.13175000000000001,861420.63]
[2689,1,1,363058.83,0,0,363058.83,9.622E-2,363089.06,574005.79,0,0,574005.79,0.15212000000000001,574029.38,937064.62,0,0,937064.62,0.24834000000000001,937118.44]
[2711,1,1,0,0,0,0,0,0,537461.98,0,0,537461.98,0.12573000000000001,537465.06000000006,537461.98,0,0,537461.98,0.12573000000000001,537465.06000000006]
[2752,1,1,749232.35,0,0,749232.35,9.3210000000000001E-2,749221.56,893121.5,0,0,893121.5,0.11111,893101.68,1642353.85,0,0,1642353.85,0.20432,1642323.24]
[2753,1,1,353002,0,0,353002,8.9410000000000003E-2,353018.49,292577,0,0,292577,7.4109999999999995E-2,292609.33,645579,0,0,645579,0.16352,645627.81999999995]
[2754,1,1,47599,0,0,47599,3.8449999999999998E-2,47603.83,210860,0,0,210860,0.17033000000000001,210880.63,258459,0,0,258459,0.20877999999999999,258484.46]
[2758,1,0,0,0,0,0,0,0,0,0,0,0,0,0,0,0,0,0,0,0]
[2759,1,1,40721.43,0,0,40721.43,4.3549999999999998E-2,40728.699999999997,49816.18,0,0,49816.18,5.3269999999999998E-2,49819.01,90537.61,0,0,90537.61,9.6820000000000003E-2,90547.71]
[2769,1,1,296908.51,0,0,296908.51,7.7020000000000005E-2,296930.51,411622.84,0,0,411622.84,0.10677,411623.87,708531.35,0,0,708531.35,0.18379000000000001,708554.38]
[2805,1,1,777387,0,0,777387,0.14432,777381.95,509321,0,0,509321,9.4549999999999995E-2,509295.06,1286708,0,0,1286708,0.23887,1286677.01]
[2835,1,1,857742,0,0,857742,0.26312000000000002,857739.49,232072,0,0,232072,7.1190000000000003E-2,232070.82,1089814,0,0,1089814,0.33431,1089810.31]
[2853,1,1,339612,0,0,339612,0.12939999999999999,339616.98,233741,0,0,233741,8.906E-2,233742.57,573353,0,0,573353,0.21845999999999999,573359.55000000005]
[2854,1,1,0,0,0,0,0,0,152504.4,0,0,152504.4,0.14849999999999999,152506.38,152504.4,0,0,152504.4,0.14849999999999999,152506.38]
[2856,1,1,310114.40999999997,0,0,310114.40999999997,0.15447,310139.46000000002,174996.1,0,0,174996.1,8.7160000000000001E-2,174996.8,485110.51,0,0,485110.51,0.24163000000000001,485136.26]
[2859,1,1,422758.76,0.24,-8,422751,5.5070000000000001E-2,422722.65,706707.41,-0.41,-14,706693,9.2060000000000003E-2,706661.47,1129466.17,-0.17,-22,1129444,0.14713000000000001,1129384.1200000001]
[2860,1,1,1713.63,0,0,1713.63,4.2999999999999999E-4,1719.88,540363.66,0,0,540363.66,0.1351,540362.18999999994,542077.29,0,0,542077.29,0.13553000000000001,542082.06999999995]
[2862,1,0,0,0,0,0,0,0,0,0,0,0,0,0,0,0,0,0,0,0]
[2884,1,1,450397.46,-0.46,0,450397,0.27057999999999999,450412.34,129631.67,0.33,0,129632,7.7880000000000005E-2,129640.45,580029.13,-0.13,0,580029,0.34845999999999999,580052.79]
[2886,1,1,832733.25,0,0,832733.25,0.51898,832734.91,121696.04,0,0,121696.04,7.5840000000000005E-2,121689.88,954429.29,0,0,954429.29,0.59482000000000002,954424.79]
[2887,1,0,0,0,0,0,0,0,0,0,0,0,0,0,0,0,0,0,0,0]
[2888,1,1,75204.600000000006,0,0,75204.600000000006,7.1040000000000006E-2,75205,145037.70000000001,0,0,145037.70000000001,0.13702,145053.35,220242.3,0,0,220242.3,0.20805999999999999,220258.35]
[2889,1,1,303986.14,0,0,303986.14,6.2330000000000003E-2,303957.98,526087.06000000006,0,0,526087.06000000006,0.10788,526086.74,830073.2,0,0,830073.2,0.17021,830044.72]
[2890,1,1,624979.82999999996,0,0,624979.82999999996,0.30363000000000001,625004.14,178076.39,0,0,178076.39,8.652E-2,178096.23,803056.22,0,0,803056.22,0.39015,803100.37]
[2895,1,1,422374.58,0.42,0,422375,8.0710000000000004E-2,422387.81,533353.39,-0.39,0,533353,0.10191,533335.91,955727.97,0.03,0,955728,0.18262,955723.72]
[2897,1,1,279749,0,0,279749,6.7930000000000004E-2,279763.73,399816,0,0,399816,9.7100000000000006E-2,399897.81,679565,0,0,679565,0.16503000000000001,679661.54]
[2898,1,1,106949.1,-0.1,0,106949,9.8710000000000006E-2,106957.52,93138.66,0.34,0,93139,8.5959999999999995E-2,93142.22,200087.76,0.24,0,200088,0.18467,200099.74]
[2899,1,1,3781,0,0,3781,6.9999999999999999E-4,3806.63,781320,0,0,781320,0.14368,781337.9,785101,0,0,785101,0.14438000000000001,785144.53]
[2902,1,1,0,0,0,0,0,0,278394,0,0,278394,0.15684000000000001,278408.71999999997,278394,0,0,278394,0.15684000000000001,278408.71999999997]
[2903,1,1,0,0,0,0,0,0,211761.36,0,0,211761.36,0.12981999999999999,211791.96,211761.36,0,0,211761.36,0.12981999999999999,211791.96]
[2904,1,1,225404,0,0,225404,7.954E-2,225422.41,325531,0,0,325531,0.11487,325550.31,550935,0,0,550935,0.19441,550972.72]
[2905,1,1,9846.43,0,0,9846.43,1.1299999999999999E-3,9843.5,1038129.41,0,0,1038129.41,0.11917,1038097.53,1047975.84,0,0,1047975.84,0.1203,1047941.03]
[2906,1,1,287684,0,0,287684,0.12751000000000001,287701.71000000002,228274,0,0,228274,0.10118000000000001,228293.14,515958,0,0,515958,0.22869,515994.85]
[2907,1,1,203619.39,0,0,203619.39,0.18484,203623.07,151404.51,0,0,151404.51,0.13744000000000001,151406.38,355023.9,0,0,355023.9,0.32228000000000001,355029.45]
[2908,1,1,196807.26,0,0,196807.26,7.8109999999999999E-2,196825.33,230506.05,0,0,230506.05,9.1490000000000002E-2,230540.89,427313.31,0,0,427313.31,0.1696,427366.22]
[3999,1,0,0,0,0,0,0,0,0,0,0,0,0,0,0,0,0,0,0,0]
[]
[null,null,null,null,null,null,null,null,null,null,null,null,null,null,null,null,null,null,null,{"$f":"AVERAGE(T4:T528)","v":0.13845657142857146}]
[]
[null,null,null,null,null,null,null,null,null,null,null,null,null,null,null,null,null,null,null,{"$f":"SUM(T4:T528)","v":72.689700000000016}]
[null,null,null,null,null,null,null,null,null,null,null,null,null,null,null,null,null,null,null,{"$f":"T532/T535","v":331}]
[null,null,null,null,null,null,null,null,null,null,null,null,null,null,null,null,null,null,null,{"$f":"T532/T533","v":0.21960634441087618}]
[null,null,null,null,null,null,null,null,null,null,null,null,null,null,null,null,null,null,"Average RMV",{"$f":"AVERAGEIF(T4:T528,\">0\")","v":0.21960634441087618}]

{"sheet":"Page 2 Middle","index":17,"n_rows":528,"n_cols":27,"rows_kept":528,"cut":false,"hidden":true,"merged":[]}
[1,2,3,4,5,6,7,8,9,10,11,12,13,14,15,16,17,18,19,20,21,22,23,24,25,26,27]
[null,null,null,"21-3","22-3","23-3","24-3","25-3","26-3","21-4","22-4","23-4","24-4","25-4","26-4","21-5","22-5","23-5","24-5","25-5","26-5","21-6","22-6","23-6","24-6","25-6","26-6"]
["dst_num","dst_tye","dst_act_sts","mnt_crt_tax_lvy_3","mnt_cua_tax_adj_3","mnt_fid_tax_adj_3","mnt_adj_tax_lvy_3","mnt_tax_rat_3","mnt_spd_tax_lvy_3","mnt_crt_tax_lvy_7","mnt_cua_tax_adj_7","mnt_fid_tax_adj_7","mnt_adj_tax_lvy_7","mnt_tax_rat_7","mnt_spd_tax_lvy_7","mnt_crt_tax_lvy","mnt_cua_tax_adj","mnt_fid_tax_adj","mnt_adj_tax_lvy","mnt_tax_mil_rat","mnt_spd_tax_lvy","cse_crt_tax_lvy","cse_cua_tax_adj","cse_fid_tax_adj","cse_adj_tax_lvy","cse_tax_mil_rat","cse_spd_tax_lvy"]
[1,1,1,0,0,0,0,0,0,23582.74,0,-916.06,22666.68,0.14000000000000001,22666.18,530245.86,0,-20597.84,509648.02,3.1480000000000001,509665.14,0,0,0,0,0,0]
[1.2,3,1,0,0,0,0,0,0,717563.47,0,-79920.5,637642.97,0.14499999999999999,639350.66,30260140.280000001,0,-3370845.89,26889294.390000001,6.0990000000000002,26892411.510000002,5330747.45,0,-593831.85,4736915.5999999996,1.075,4740013.51]
[2,1,1,0,0,0,0,0,0,1870.28,0,0,1870.28,0.13400000000000001,1865.59,67990.759999999995,0,0,67990.759999999995,4.8840000000000003,67996.710000000006,16950.599999999999,0,0,16950.599999999999,1.218,16957.41]
[4,1,1,0,0,0,0,0,0,12239.94,0,0,12239.94,0.14499999999999999,12279.59,282939.59999999998,0,0,282939.59999999998,3.3410000000000002,282938.59999999998,56360.3,0,0,56360.3,0.66600000000000004,56401.41]
[6,3,1,566074,0,-138673,427401,3.4710000000000001,427437.48,23795,0,-5830,17965,0.14599999999999999,17979.22,1500064,0,-367475,1132589,9.1980000000000004,1132690.8400000001,511682,0,-125348,386334,3.137,386306.93]
[11,1,1,3260754.62,0,-562572,2698182.62,1.4490000000000001,2699215.14,313336.99,0,-118711,194625.99,0.105,195595.3,25748809.739999998,0,-4774208,20974601.739999998,11.26,20975267.399999999,3456932.84,0,-569291,2887641.84,1.5509999999999999,2889222]
[12,1,1,0,0,0,0,0,0,46091.53,0,-15573,30518.53,0.108,30635.51,3464306.38,0,-586212,2878094.38,10.147,2878319.33,581435.19999999995,0,-66283,515152.2,1.8169999999999999,515414.04]
[13,1,1,1127233.3700000001,0,-293649,833584.37,5.3129999999999997,833716.33,29879.45,0,-20773,9106.4500000000007,5.8999999999999997E-2,9258.2800000000007,2458748.36,0,-648955,1809793.36,11.534000000000001,1809916.09,259678.35,0,-148873,110805.35,0.70699999999999996,110942.49]
[14,1,1,717634.6,0,-160458,557176.6,4.8710000000000004,557181.17000000004,19977.77,0,-9565,10412.77,9.1999999999999998E-2,10523.64,2285767.85,0,-327852,1957915.85,17.117000000000001,1957969.64,329630.34000000003,0,-78048,251582.34,2.2000000000000002,251652.35]
[15,1,1,0,0,0,0,0,0,41529.67,0,-14520,27009.67,0.108,27023.77,2155118.41,0,-243056,1912062.41,7.6420000000000003,1912181.7,357315.7,0,-59807,297508.7,1.1890000000000001,297511.65000000002]
[16,1,1,1085968.23,0,-153478,932490.23,2.677,932598.38,57634.78,0,-16867,40767.78,0.11799999999999999,41108.18,2931728.3,0,-424820,2506908.2999999998,7.1970000000000001,2507250.84,414944.83,0,-69924,345020.83,0.99099999999999999,345239.07]
[21,1,0,0,0,0,0,0,0,0,0,0,0,0,0,0,0,0,0,0,0,0,0,0,0,0,0]
[22,1,1,0,0,0,0,0,0,34839.19,0,0,34839.19,0.14799999999999999,34840.04,1900125.74,0,0,1900125.74,8.0679999999999996,1900125.65,210990.57,0,0,210990.57,0.89600000000000002,210990.3]
[23,1,1,0,0,0,0,0,0,11091.55,0,0,11091.55,0.14499999999999999,11091.66,449388.31,0,0,449388.31,5.8650000000000002,449387.7,84092.69,0,0,84092.69,1.0980000000000001,84093.11]
[24,1,0,0,0,0,0,0,0,0,0,0,0,0,0,0,0,0,0,0,0,0,0,0,0,0,0]
[25,1,1,0,0,0,0,0,0,0,0,0,0,0,0,0,0,0,0,0,0,0,0,0,0,0,0]
[31,1,1,0,0,0,0,0,0,47096.28,0,0,47096.28,0.14199999999999999,47079.83,2583497.2000000002,0,0,2583497.2000000002,7.8070000000000004,2588395.94,398860.84,0,0,398860.84,1.2050000000000001,399515.45]
[32,1,1,0,0,0,0,0,0,4364.37,0,0,4364.37,0.14199999999999999,4351.83,254089.55,0,0,254089.55,8.2910000000000004,254091.71,31748,0,0,31748,1.036,31749.97]
[36,1,1,0,0,0,0,0,0,1507.03,0,0,1507.03,0.13500000000000001,1511.34,34192.239999999998,0,0,34192.239999999998,3.0539999999999998,34189.870000000003,10762.94,0,0,10762.94,0.96099999999999997,10758.5]
[38,1,1,0,0,0,0,0,0,17.399999999999999,0,0,17.399999999999999,0.106,17.010000000000002,576.62,0,0,576.62,3.589,575.92999999999995,156.69999999999999,0,0,156.69999999999999,0.97799999999999998,156.94]
[47,1,1,0,0,0,0,0,0,24818.79,0,0,24818.79,0.14099999999999999,24832.75,1248399.8999999999,0,0,1248399.8999999999,7.0880000000000001,1248329.98,258089.54,0,0,258089.54,1.4650000000000001,258014.03]
[51,1,1,0,0,0,0,0,0,10152.780000000001,0,0,10152.780000000001,0.14199999999999999,10122.07,256515.04,0,0,256515.04,3.5990000000000002,256544.57,92420.66,0,0,92420.66,1.2969999999999999,92452.99]
[55,1,0,0,0,0,0,0,0,0,0,0,0,0,0,0,0,0,0,0,0,0,0,0,0,0,0]
[57,1,0,0,0,0,0,0,0,0,0,0,0,0,0,0,0,0,0,0,0,0,0,0,0,0,0]
[58,1,0,0,0,0,0,0,0,0,0,0,0,0,0,0,0,0,0,0,0,0,0,0,0,0,0]
[60,1,0,0,0,0,0,0,0,0,0,0,0,0,0,0,0,0,0,0,0,0,0,0,0,0,0]
[62,1,0,0,0,0,0,0,0,0,0,0,0,0,0,0,0,0,0,0,0,0,0,0,0,0,0]
[70,1,0,0,0,0,0,0,0,0,0,0,0,0,0,0,0,0,0,0,0,0,0,0,0,0,0]
[72,1,0,0,0,0,0,0,0,0,0,0,0,0,0,0,0,0,0,0,0,0,0,0,0,0,0]
[75,1,1,0,0,0,0,0,0,6511.64,0,0,6511.64,0.152,6512.4,187991.4,0,0,187991.4,4.3730000000000002,187991.42,34495.1,0,0,34495.1,0.80300000000000005,34496.400000000001]
[77,1,1,500000,0,0,500000,0.76800000000000002,499800.49,92722.45,0,0,92722.45,0.14199999999999999,92707.55,4111826.21,0,0,4111826.21,6.3129999999999997,4109926.43,786459.58,0,0,786459.58,1.208,786126.21]
[78,1,0,0,0,0,0,0,0,0,0,0,0,0,0,0,0,0,0,0,0,0,0,0,0,0,0]
[79,1,0,0,0,0,0,0,0,0,0,0,0,0,0,0,0,0,0,0,0,0,0,0,0,0,0]
[81,1,1,0,0,0,0,0,0,5988.42,0,0,5988.42,0.13400000000000001,5969.2,121575.73,0,0,121575.73,2.7290000000000001,121566.74,26145.84,0,0,26145.84,0.58699999999999997,26148.65]
[84,1,1,0,0,0,0,0,0,12663.13,0,0,12663.13,0.13700000000000001,12702.47,440774.74,0,0,440774.74,4.7539999999999996,440784.84,75995.850000000006,0,0,75995.850000000006,0.82,76029.36]
[85,1,1,0,0,0,0,0,0,8898.2000000000007,0,0,8898.2000000000007,0.13600000000000001,8885.08,346599.38,0,0,346599.38,5.3049999999999997,346583.5,46667,0,0,46667,0.71399999999999997,46646.68]
[88,1,1,0,0,0,0,0,0,31117.19,0,0,31117.19,0.14199999999999999,31043.86,1531834.83,0,0,1531834.83,7.0069999999999997,1531861.65,224275.07,0,0,224275.07,1.026,224302.85]
[91,1,1,0,0,0,0,0,0,4448.6499999999996,0,0,4448.6499999999996,0.14299999999999999,4461.4799999999996,138000.62,0,0,138000.62,4.423,137993.93,48431.7,0,0,48431.7,1.552,48421.11]
[93,1,1,0,0,0,0,0,0,6584.1,0,0,6584.1,0.14099999999999999,6594.27,111811.47,0,0,111811.47,2.391,111822,51549.99,0,0,51549.99,1.1020000000000001,51538.2]
[94,1,1,0,0,0,0,0,0,14621.08,0,0,14621.08,0.14099999999999999,14572.05,849095.14,0,0,849095.14,8.2159999999999993,849105.94,250247.3,0,0,250247.3,2.4209999999999998,250205.14]
[95,1,1,0,0,0,0,0,0,2656.4,0,0,2656.4,0.13100000000000001,2652.39,156538.5,0,0,156538.5,7.7309999999999999,156531.49,21179.02,0,0,21179.02,1.046,21178.62]
[97,1,1,0,0,0,0,0,0,5999.69,0,0,5999.69,0.14099999999999999,6010.43,238852.99,0,0,238852.99,5.6029999999999998,238839.87,54496.14,0,0,54496.14,1.278,54477.48]
[99,1,1,0,0,0,0,0,0,7322.39,0,0,7322.39,0.13900000000000001,7317.97,292871.21000000002,0,0,292871.21000000002,5.5629999999999997,292876.71000000002,61604.68,0,0,61604.68,1.17,61597.29]
[100,1,1,0,0,0,0,0,0,4527.1899999999996,0,0,4527.1899999999996,0.13700000000000001,4542.71,180691.38,0,0,180691.38,5.4489999999999998,180680.67,25838.19,0,0,25838.19,0.77900000000000003,25830.47]
[108,1,1,0,0,0,0,0,0,13686,0,-1654,12032,0.13900000000000001,12032,687341,0,-83046,604295,6.9729999999999999,604295,124378,0,-15028,109350,1.262,109350]
[110,1,1,0,0,0,0,0,0,36233,0,-3396,32837,0.13800000000000001,32837,707441,0,-66304,641137,2.694,641137,253576,0,-23767,229809,0.96599999999999997,229809]
[111,1,1,0,0,0,0,0,0,16596,0,-1954,14642,0.13800000000000001,14642,377320,0,-44406,332914,3.1349999999999998,332914,292471,0,-34420,258051,2.4300000000000002,258051]
[112,1,1,3644140,0,-292962,3351178,4.758,3351179,109303,0,-8787,100516,0.14299999999999999,100516,6076030,0,-488467,5587563,7.9340000000000002,5587563,858974,0,-69055,789919,1.1220000000000001,789919]
[113,1,1,0,0,0,0,0,0,27831.46,0,0,27831.46,0.14099999999999999,27760.68,519314.31,0,0,519314.31,2.6379999999999999,519380.76,97840.95,0,0,97840.95,0.497,97851.49]
[114,1,0,0,0,0,0,0,0,0,0,0,0,0,0,0,0,0,0,0,0,0,0,0,0,0,0]
[115,1,1,0,0,0,0,0,0,11419.96,0,0,11419.96,0.13400000000000001,11449.09,202866.41,0,0,202866.41,2.3740000000000001,202836.89,63589.14,0,0,63589.14,0.74399999999999999,63568.09]
[116,1,1,0,0,0,0,0,0,14522.67,0,0,14522.67,0.14499999999999999,14477.06,371707.69,0,0,371707.69,3.7229999999999999,371710.87,107931.62,0,0,107931.62,1.081,107928.94]
[117,1,0,0,0,0,0,0,0,0,0,0,0,0,0,0,0,0,0,0,0,0,0,0,0,0,0]
[118,1,1,0,0,0,0,0,0,22165.919999999998,0,0,22165.919999999998,0.14499999999999999,22092.99,97716.06,0,0,97716.06,0.64100000000000001,97666.25,70938.53,0,0,70938.53,0.46600000000000003,71002.3]
[119,1,0,0,0,0,0,0,0,0,0,0,0,0,0,0,0,0,0,0,0,0,0,0,0,0,0]
[126,1,0,0,0,0,0,0,0,0,0,0,0,0,0,0,0,0,0,0,0,0,0,0,0,0,0]
[127,1,0,0,0,0,0,0,0,0,0,0,0,0,0,0,0,0,0,0,0,0,0,0,0,0,0]
[128,1,0,0,0,0,0,0,0,0,0,0,0,0,0,0,0,0,0,0,0,0,0,0,0,0,0]
[129,1,1,0,0,0,0,0,0,11953.41,0,0,11953.41,0.14399999999999999,11989.05,667284.97,0,0,667284.97,8.0150000000000006,667307.34,105036.6,0,0,105036.6,1.262,105070.73]
[138,1,1,0,0,0,0,0,0,23369.84,0,0,23369.84,0.14199999999999999,23370,1284155.1000000001,0,0,1284155.1000000001,7.7990000000000004,1284155,211672.53,0,0,211672.53,1.286,211673]
[139,1,1,0,0,0,0,0,0,6571.06,0,0,6571.06,0.14000000000000001,6571,248858.1,0,0,248858.1,5.3049999999999997,248859,59501.46,0,0,59501.46,1.268,59501]
[140,1,0,0,0,0,0,0,0,0,0,0,0,0,0,0,0,0,0,0,0,0,0,0,0,0,0]
[141,1,0,0,0,0,0,0,0,0,0,0,0,0,0,0,0,0,0,0,0,0,0,0,0,0,0]
[145,1,0,0,0,0,0,0,0,0,0,0,0,0,0,0,0,0,0,0,0,0,0,0,0,0,0]
[146,1,1,0,0,0,0,0,0,12605.38,0,0,12605.38,0.153,12605,400181.49,0,0,400181.49,4.8550000000000004,400181,64025.599999999999,0,0,64025.599999999999,0.77700000000000002,64026]
[147,1,0,0,0,0,0,0,0,0,0,0,0,0,0,0,0,0,0,0,0,0,0,0,0,0,0]
[150,1,1,0,0,0,0,0,0,7333.86,0,0,7333.86,0.14699999999999999,7334,257884.32,0,0,257884.32,5.18,257884,51149.15,0,0,51149.15,1.028,51149]
[152,1,1,0,0,0,0,0,0,53930.28,0,0,53930.28,0.13800000000000001,53930,2966237.03,0,0,2966237.03,7.5869999999999997,2966237,465166.09,0,0,465166.09,1.19,465166]
[158,1,0,0,0,0,0,0,0,0,0,0,0,0,0,0,0,0,0,0,0,0,0,0,0,0,0]
[161,1,0,0,0,0,0,0,0,0,0,0,0,0,0,0,0,0,0,0,0,0,0,0,0,0,0]
[162,1,1,0,0,0,0,0,0,6729,0,0,6729,0.14299999999999999,6728.12,787240,0,0,787240,16.72,787241.74,61263,0,0,61263,1.3009999999999999,61264.02]
[166,1,1,0,0,0,0,0,0,22992.46,0,-153.01,22839.45,0.14199999999999999,22784,104545.88,0,-695.74,103850.14,0.64700000000000002,103811.62,0,0,0,0,0,0]
[173,1,1,0,0,0,0,0,0,9412.02,-0.02,0,9412,0.13400000000000001,9426.25,316566.56,0.44,0,316567,4.5010000000000003,316623.52,43446.42,-0.42,0,43446,0.61799999999999999,43473.3]
[175,1,0,0,0,0,0,0,0,0,0,0,0,0,0,0,0,0,0,0,0,0,0,0,0,0,0]
[177,1,1,0,0,0,0,0,0,13723.2,-0.2,0,13723,0.13600000000000001,13743.29,587378.66,0.34,0,587379,5.8129999999999997,587424.4,82406.11,-0.11,0,82406,0.81599999999999995,82459.710000000006]
[178,1,0,0,0,0,0,0,0,0,0,0,0,0,0,0,0,0,0,0,0,0,0,0,0,0,0]
[181,1,1,0,0,0,0,0,0,78762.42,0,0,78762.42,0.14099999999999999,79088.490000000005,4107160.62,0,0,4107160.62,7.3230000000000004,4107553.16,571614.09,0,0,571614.09,1.02,572129.49]
[182,1,1,0,0,0,0,0,0,27673.53,0,-912.85,26760.68,0.14099999999999999,26825.599999999999,647190.82999999996,0,-21348.39,625842.43999999994,3.29,625930.73,0,0,0,0,0,0]
[186,1,1,0,0,0,0,0,0,44759.22,0,0,44759.22,0.14099999999999999,44764.639999999999,853638.97,0,0,853638.97,2.6890000000000001,853702.99,201854.53,0,0,201854.53,0.63600000000000001,201917.11]
[191,1,1,2544339,0,-319342,2224997,3.4180000000000001,2225467.59,101874,0,-12788,89086,0.13700000000000001,89201.01,5806561,0,-728788,5077773,7.7990000000000004,5077946.68,1556452,0,-195350,1361102,2.09,1360803.77]
[192,1,1,0,0,0,0,0,0,47116,0,-6824,40292,0.13900000000000001,40217.93,2506121,0,-363002,2143119,7.407,2143123.75,659878,0,-95580,564298,1.9510000000000001,564497.69999999995]
[194,1,1,2102255,0,-210489,1891766,2.8,1891953.48,103120,0,-10326,92794,0.13700000000000001,92570.58,5415765,0,-542257,4873508,7.2130000000000001,4873807.29,1057814,0,-105915,951899,1.409,952058.02]
[195,1,1,0,0,0,0,0,0,6955,0,-260,6695,0.13400000000000001,6670.42,267227,0,-9971,257256,5.1680000000000001,257259.11,44933,0,-1677,43256,0.86899999999999999,43258.16]
[196,1,1,5049218,0,-577878,4471340,2.8719999999999999,4471695.79,251612,0,-28798,222814,0.14299999999999999,222650.59,17268485,0,-1976367,15292118,9.8219999999999992,15292825.91,1671936,0,-191354,1480582,0.95099999999999996,1480704.28]
[197,1,1,1348799,0,-116051,1232748,2.1379999999999999,1232972.56,91312,0,-7856,83456,0.14499999999999999,83620.679999999993,4111915,0,-353790,3758125,6.5170000000000003,3758317.21,1128722,0,-97116,1031606,1.7889999999999999,1031706.23]
[199,1,1,0,0,0,0,0,0,41720,0,-5192,36528,0.14099999999999999,36495.08,2844642,0,-354065,2490577,9.6229999999999993,2490724.75,451061,0,-56142,394919,1.526,394975.16]
[200,1,1,0,0,0,0,0,0,51627,0,-6869,44758,0.14099999999999999,44660.15,2360042,0,-313981,2046061,6.46,2046131.49,460392,0,-61251,399141,1.26,399090.66]
[201,1,0,0,0,0,0,0,0,0,0,0,0,0,0,0,0,0,0,0,0,0,0,0,0,0,0]
[202,1,0,0,0,0,0,0,0,0,0,0,0,0,0,0,0,0,0,0,0,0,0,0,0,0,0]
[203,1,1,0,0,0,0,0,0,13193,0,0,13193,0.14699999999999999,13195.94,596464,0,0,596464,6.6440000000000001,596420.65,38548,0,0,38548,0.42899999999999999,38510.6]
[204,1,1,0,0,0,0,0,0,12388,0,0,12388,0.14000000000000001,12358.4,542335,0,0,542335,6.1440000000000001,542357.36,115966,0,0,115966,1.3140000000000001,115992.44]
[205,1,0,0,0,0,0,0,0,0,0,0,0,0,0,0,0,0,0,0,0,0,0,0,0,0,0]
[206,1,1,0,0,0,0,0,0,60815.199999999997,0,0,60815.199999999997,0.13900000000000001,60961.48,1759892.21,0,0,1759892.21,4.0129999999999999,1759988.51,494369.8,0,0,494369.8,1.1279999999999999,494708.96]
[207,1,0,0,0,0,0,0,0,0,0,0,0,0,0,0,0,0,0,0,0,0,0,0,0,0,0]
[208,1,0,0,0,0,0,0,0,0,0,0,0,0,0,0,0,0,0,0,0,0,0,0,0,0,0]
[209,1,0,0,0,0,0,0,0,0,0,0,0,0,0,0,0,0,0,0,0,0,0,0,0,0,0]
[213,1,1,0,0,0,0,0,0,6898.42,0,0,6898.42,0.15,6937.83,223753.85,0,0,223753.85,4.8380000000000001,223768.24,49195.48,0,0,49195.48,1.0640000000000001,49212.36]
[217,1,0,0,0,0,0,0,0,0,0,0,0,0,0,0,0,0,0,0,0,0,0,0,0,0,0]
[218,1,0,0,0,0,0,0,0,0,0,0,0,0,0,0,0,0,0,0,0,0,0,0,0,0,0]
[219,1,0,0,0,0,0,0,0,0,0,0,0,0,0,0,0,0,0,0,0,0,0,0,0,0,0]
[222,1,0,0,0,0,0,0,0,0,0,0,0,0,0,0,0,0,0,0,0,0,0,0,0,0,0]
[223,1,0,0,0,0,0,0,0,0,0,0,0,0,0,0,0,0,0,0,0,0,0,0,0,0,0]
[224,1,0,0,0,0,0,0,0,0,0,0,0,0,0,0,0,0,0,0,0,0,0,0,0,0,0]
[225,1,0,0,0,0,0,0,0,0,0,0,0,0,0,0,0,0,0,0,0,0,0,0,0,0,0]
[227,1,1,0,0,0,0,0,0,10167,0,0,10167,0.14899999999999999,10047.61,355884,0,0,355884,5.2210000000000001,352070.93,89834,0,0,89834,1.3180000000000001,88877.51]
[228,1,0,0,0,0,0,0,0,0,0,0,0,0,0,0,0,0,0,0,0,0,0,0,0,0,0]
[229,1,1,0,0,0,0,0,0,4584.28,0,0,4584.28,0.155,4589.2,145493.72,0,0,145493.72,4.9139999999999997,145492.29,21663.47,0,0,21663.47,0.73199999999999998,21672.84]
[232,1,0,0,0,0,0,0,0,0,0,0,0,0,0,0,0,0,0,0,0,0,0,0,0,0,0]
[233,1,0,0,0,0,0,0,0,0,0,0,0,0,0,0,0,0,0,0,0,0,0,0,0,0,0]
[234,1,0,0,0,0,0,0,0,0,0,0,0,0,0,0,0,0,0,0,0,0,0,0,0,0,0]
[236,1,0,0,0,0,0,0,0,0,0,0,0,0,0,0,0,0,0,0,0,0,0,0,0,0,0]
[237,1,0,0,0,0,0,0,0,0,0,0,0,0,0,0,0,0,0,0,0,0,0,0,0,0,0]
[238,1,1,0,0,0,0,0,0,4934.8,0,0,4934.8,0.14099999999999999,4951.71,98408.34,0,0,98408.34,2.802,98402.04,45135.05,0,0,45135.05,1.2849999999999999,45127.27]
[239,1,1,0,0,0,0,0,0,8337.08,0,0,8337.08,0.161,8331.36,194694.01,0,0,194694.01,3.762,194674.47,79595.63,0,0,79595.63,1.538,79587.81]
[240,1,0,0,0,0,0,0,0,0,0,0,0,0,0,0,0,0,0,0,0,0,0,0,0,0,0]
[241,1,1,0,0,0,0,0,0,26224.74,0,0,26224.74,0.13500000000000001,26279.18,1485641.07,0,0,1485641.07,7.6319999999999997,1485649.7,237032.09,0,0,237032.09,1.218,237096.61]
[242,1,1,0,0,0,0,0,0,4678.3100000000004,0,0,4678.3100000000004,0.13800000000000001,4676.25,315895.06,0,0,315895.06,9.3219999999999992,315883.89,19448.62,0,0,19448.62,0.57399999999999995,19450.48]
[243,1,0,0,0,0,0,0,0,0,0,0,0,0,0,0,0,0,0,0,0,0,0,0,0,0,0]
[244,1,0,0,0,0,0,0,0,0,0,0,0,0,0,0,0,0,0,0,0,0,0,0,0,0,0]
[245,1,0,0,0,0,0,0,0,0,0,0,0,0,0,0,0,0,0,0,0,0,0,0,0,0,0]
[252,1,1,0,0,0,0,0,0,14028.58,0.42,-14.23,14014.77,0.13600000000000001,14048.41,263927.5,0.5,-267.67,263660.33,2.552,263614.33,125590.36,-0.36,-127.37,125462.63,1.2150000000000001,125506.04]
[253,1,1,0,0,0,0,0,0,6705.54,-0.54,0,6705,0.14299999999999999,6702.18,268443.58,0.42,0,268444,5.7279999999999998,268461.96999999997,41072.06,-0.06,0,41072,0.876,41056.68]
[254,1,0,0,0,0,0,0,0,0,0,0,0,0,0,0,0,0,0,0,0,0,0,0,0,0,0]
[255,1,1,0,0,0,0,0,0,9897.08,-0.08,0,9897,0.13,9930.18,429191.91,0.09,0,429192,5.6189999999999998,429212.88,117716.74,0.26,0,117717,1.5409999999999999,117710.81]
[256,1,1,0,0,0,0,0,0,49128.13,-0.13,0,49128,0.13400000000000001,49308.78,1917875,0,0,1917875,5.2119999999999997,1917890.86,327770.13,-0.13,0,327770,0.89100000000000001,327866.61]
[258,1,0,0,0,0,0,0,0,0,0,0,0,0,0,0,0,0,0,0,0,0,0,0,0,0,0]
[260,1,0,0,0,0,0,0,0,0,0,0,0,0,0,0,0,0,0,0,0,0,0,0,0,0,0]
[261,1,1,0,0,0,0,0,0,3539.97,0,0,3539.97,0.14599999999999999,3558.95,102456,0,0,102456,4.2039999999999997,102478.18,18725.509999999998,0,0,18725.509999999998,0.76900000000000002,18745.41]
[262,1,0,0,0,0,0,0,0,0,0,0,0,0,0,0,0,0,0,0,0,0,0,0,0,0,0]
[263,1,0,0,0,0,0,0,0,0,0,0,0,0,0,0,0,0,0,0,0,0,0,0,0,0,0]
[264,1,1,72659.92,0,0,72659.92,1.417,72744.91,8961.44,0,0,8961.44,0.17499999999999999,8984.02,72039,0,0,72039,1.4039999999999999,72077.53,30773.31,0,0,30773.31,0.6,30802.36]
[265,1,0,0,0,0,0,0,0,0,0,0,0,0,0,0,0,0,0,0,0,0,0,0,0,0,0]
[270,1,1,9056555.4600000009,0,-549236.87,8507318.5899999999,7.9,8508155.9000000004,164978.57999999999,0,-10008.16,154970.42000000001,0.14399999999999999,155085.37,3526724.68,0,-213877.54,3312847.14,3.077,3313872.88,1425018.38,0,-86420.57,1338597.81,1.2430000000000001,1338688.33]
[271,1,1,6864949.5999999996,0,-478331.14,6386618.46,5.08,6387478.5099999998,183078.16,0,-12753.53,170324.63,0.13600000000000001,171003.36,9340180.6300000008,0,-650800.15,8689380.4800000004,6.9109999999999996,8689737.0099999998,1760191.76,0,-122643.67,1637548.09,1.3029999999999999,1638363.09]
[272,1,1,6442623.6799999997,0,-312721.61,6129902.0700000003,6.3810000000000002,6130207.3700000001,149117.85,0,-7240.1,141877.75,0.14799999999999999,142183.15,6634114.3300000001,0,-322017.65000000002,6312096.6799999997,6.5709999999999997,6312739.79,851482.89,0,-41329.78,810153.11,0.84399999999999997,810828.24]
[273,1,1,5344774.47,0,-139462.60999999999,5205311.8600000003,5.3659999999999997,5205842.72,147221.73000000001,0,-3843.32,143378.41,0.14799999999999999,143582.69,12652234.23,0,-330137.89,12322096.34,12.702,12322887.470000001,1119656.28,0,-29214.959999999999,1090441.32,1.1240000000000001,1090452.33]
[276,1,1,5653426.3300000001,0,-182591.52,5470834.8099999996,6.3170000000000002,5471173.4699999997,131379.20000000001,0,-4241.87,127137.33,0.14699999999999999,127317.16,5942132.7000000002,0,-191915,5750217.7000000002,6.64,5750924.7800000003,921516.52,0,-29762.09,891754.43,1.03,892086.22]
[277,1,1,1166779.77,0,-42389.120000000003,1124390.6499999999,3.077,1124675.53,51577.71,0,-1873.55,49704.160000000003,0.13600000000000001,49709.42,2246789.54,0,-81626.09,2165163.4500000002,5.9240000000000004,2165283.67,561726.02,0,-20407.580000000002,541318.43999999994,1.4810000000000001,541320.92000000004]
[278,1,1,912334.54,0,-19055.740000000002,893278.8,2.3690000000000002,893529.33,53754.54,0,-1122.6500000000001,52631.89,0.14000000000000001,52804.6,2154390.7000000002,0,-44998.1,2109392.6,5.593,2109543.91,268118.12,0,-5600.16,262517.96000000002,0.69699999999999995,262891.49]
[279,1,1,5785886.5899999999,0,-674767.73,5111118.8600000003,3.4540000000000002,5112110.9400000004,232203.89,0,-27093.58,205110.31,0.13900000000000001,205727.68,18100278.370000001,0,-2110927.0699999998,15989351.300000001,10.804,15990517.25,2522118.5,0,-294134.90999999997,2227983.59,1.506,2228963.25]
[280,1,1,2771333.1,0,-400542.65,2370790.4500000002,5.9219999999999997,2370957.62,65505.38,0,-9468.36,56037.02,0.14000000000000001,56051.01,4177010.15,0,-603705.94999999995,3573304.2,8.9260000000000002,3573652.1,454681.76,0,-65714.649999999994,388967.11,0.97199999999999998,389154.14]
[281,1,1,3925855.91,0,-674644.66,3251211.25,3.87,3251473.65,138566.35999999999,0,-23816.58,114749.78,0.13700000000000001,115103.85,6094216.3099999996,0,-1047265.68,5046950.63,6.008,5047765.8099999996,1849286.65,0,-317792.33,1531494.32,1.823,1531637.33]
[282,1,1,634127.23,0,-85104.43,549022.80000000005,5.8620000000000001,549056.31999999995,15587.06,0,-2093,13494.06,0.14499999999999999,13581.23,1124248.28,0,-150882.19,973366.09,10.393000000000001,973446.31,175178.33,0,-23509.85,151668.48000000001,1.62,151735.10999999999]
[283,1,1,2226967.2000000002,0,-187751.27,2039215.93,3.5680000000000001,2039529.92,86883,0,-7326.99,79556.009999999995,0.14000000000000001,80026.399999999994,3326586.09,0,-280456.84000000003,3046129.25,5.3289999999999997,3046147.69,952961.35,0,-80343.210000000006,872618.14,1.5269999999999999,872859.36]
[284,1,1,6424402.6399999997,0,-290978.18,6133424.46,4.6820000000000004,6134541.8099999996,194386.21,0,-8805.49,185580.72,0.14199999999999999,186054.02,20056927.010000002,0,-908434.96,19148492.050000001,14.615,19149151.75,1004744.72,0,-45507.9,959236.82,0.73299999999999998,960405.63]
[286,1,1,0,0,0,0,0,0,10476.52,0,-3558.78,6917.74,0.13300000000000001,6922.78,936506.35,0,-318085.88,618420.47,11.882,618469.51,140840.69,0,-47837.36,93003.33,1.7869999999999999,93015.07]
[287,6,0,0,0,0,0,0,0,0,0,0,0,0,0,0,0,0,0,0,0,0,0,0,0,0,0]
[288,6,0,0,0,0,0,0,0,0,0,0,0,0,0,0,0,0,0,0,0,0,0,0,0,0,0]
[294,1,1,0,0,0,0,0,0,4673,0,0,4673,0.14599999999999999,4681.74,78810,0,0,78810,2.4580000000000002,78819.95,35630,0,0,35630,1.111,35626.1]
[297,1,1,0,0,0,0,0,0,3631,0,0,3631,0.151,3634.26,118334,0,0,118334,4.9169999999999998,118342.11,27070,0,0,27070,1.125,27076.44]
[299,1,1,0,0,0,0,0,0,8577,0,0,8577,0.15,8574.7999999999993,561459,0,0,561459,9.8219999999999992,561477.87,73838,0,0,73838,1.292,73857.61]
[300,1,1,0,0,0,0,0,0,10245,0,0,10245,0.14199999999999999,10228.31,451814,0,0,451814,6.2729999999999997,451846.2,168775,0,0,168775,2.343,168767.04]
[301,1,0,0,0,0,0,0,0,0,0,0,0,0,0,0,0,0,0,0,0,0,0,0,0,0,0]
[306,1,1,0,0,0,0,0,0,3349,0,0,3349,0.13100000000000001,3339.91,142995,0,0,142995,5.609,143004.43,17500,0,0,17500,0.68600000000000005,17489.93]
[308,1,1,0,0,0,0,0,0,8125,0,0,8125,0.13600000000000001,8135.98,202888,0,0,202888,3.391,202861.01,37350,0,0,37350,0.624,37329.78]
[309,1,1,0,0,0,0,0,0,30588,0,0,30588,0.14599999999999999,30687.89,716223,0,0,716223,3.407,716120.81,197745,0,0,197745,0.94099999999999995,197789.75]
[314,1,1,0,0,0,0,0,0,5699,0,0,5699,0.13900000000000001,5699,259156,0,0,259156,6.3330000000000002,259155.97,51861,0,0,51861,1.2669999999999999,51861]
[316,1,1,0,0,0,0,0,0,9262.76,0,-826.27,8436.49,0.13200000000000001,8459.66,114407.85,0,-10201.59,104206.26,1.6259999999999999,104207.69,0,0,0,0,0,0]
[317,1,1,0,0,0,0,0,0,11548.22,0,0,11548.22,0.13800000000000001,11534.46,42147.15,0,0,42147.15,0.504,42125.86,0,0,0,0,0,0]
[318,1,1,0,0,0,0,0,0,61829.82,0,-1606.9,60222.92,0.14299999999999999,60423.9,2543812.96,0,-66111.48,2477701.48,5.8639999999999999,2477802.4700000002,0,0,0,0,0,0]
[319,1,1,0,0,0,0,0,0,5343.42,0,-321.35000000000002,5022.07,0.14499999999999999,5029.7299999999996,73050.41,0,-4393.2700000000004,68657.14,1.9790000000000001,68647.100000000006,0,0,0,0,0,0]
[323,2,1,0,0,0,0,0,0,410.72,0,0,410.72,0.13700000000000001,411,3161.28,0,0,3161.28,1.05,3161,0,0,0,0,0,0]
[324,1,0,0,0,0,0,0,0,0,0,0,0,0,0,0,0,0,0,0,0,0,0,0,0,0,0]
[325,1,0,0,0,0,0,0,0,0,0,0,0,0,0,0,0,0,0,0,0,0,0,0,0,0,0]
[328,1,0,0,0,0,0,0,0,0,0,0,0,0,0,0,0,0,0,0,0,0,0,0,0,0,0]
[330,1,1,0,0,0,0,0,0,8700.44,-0.44,0,8700,0.13400000000000001,8673,254565.98,0.02,0,254566,3.9329999999999998,254559.06,29535.65,0.35,0,29536,0.45600000000000002,29514.09]
[332,1,1,0,0,0,0,0,0,10129.14,0,0,10129.14,0.14299999999999999,10140.73,572291.29,0,0,572291.29,8.07,572277.67000000004,96085.46,0,0,96085.46,1.355,96088.75]
[333,1,1,0,0,0,0,0,0,3223.57,0,0,3223.57,0.14899999999999999,3225.48,99172,0,0,99172,4.5810000000000004,99167.2,29332.23,0,0,29332.23,1.355,29332.36]
[341,1,0,0,0,0,0,0,0,0,0,0,0,0,0,0,0,0,0,0,0,0,0,0,0,0,0]
[345,1,1,0,0,0,0,0,0,20323.45,0,0,20323.45,0.14699999999999999,20371.72,818889.99,0,0,818889.99,5.91,819026.42,141593.97,0,0,141593.97,1.022,141631.98000000001]
[346,1,0,0,0,0,0,0,0,0,0,0,0,0,0,0,0,0,0,0,0,0,0,0,0,0,0]
[347,1,1,0,0,0,0,0,0,34523.410000000003,0,0,34523.410000000003,0.14599999999999999,34536.04,2397162.7200000002,0,0,2397162.7200000002,10.135,2397416.5099999998,407745.08,0,0,407745.08,1.724,407809.18]
[351,1,0,0,0,0,0,0,0,0,0,0,0,0,0,0,0,0,0,0,0,0,0,0,0,0,0]
[352,1,0,0,0,0,0,0,0,0,0,0,0,0,0,0,0,0,0,0,0,0,0,0,0,0,0]
[353,1,0,0,0,0,0,0,0,0,0,0,0,0,0,0,0,0,0,0,0,0,0,0,0,0,0]
[354,1,0,0,0,0,0,0,0,0,0,0,0,0,0,0,0,0,0,0,0,0,0,0,0,0,0]
[356,1,1,0,0,0,0,0,0,1917,0,0,1917,0.14499999999999999,1915.29,95944,0,0,95944,7.2640000000000002,95949.45,11722,0,0,11722,0.88700000000000001,11716.29]
[361,1,1,0,0,0,0,0,0,10301.35,0,0,10301.35,0.13800000000000001,10337.26,1010007.16,0,0,1010007.16,13.484,1010055.02,115461.1,0,0,115461.1,1.5409999999999999,115432.72]
[362,1,1,0,0,0,0,0,0,2046.35,0,0,2046.35,0.152,2051.94,86552.33,0,0,86552.33,6.4109999999999996,86545.94,18506.5,0,0,18506.5,1.371,18507.95]
[363,1,1,0,0,0,0,0,0,2527.4899999999998,0,0,2527.4899999999998,0.155,2527.1999999999998,176533.14,0,0,176533.14,10.827,176528.71,15655.92,0,0,15655.92,0.96,15652.31]
[371,1,0,0,0,0,0,0,0,0,0,0,0,0,0,0,0,0,0,0,0,0,0,0,0,0,0]
[376,1,0,0,0,0,0,0,0,0,0,0,0,0,0,0,0,0,0,0,0,0,0,0,0,0,0]
[377,1,0,0,0,0,0,0,0,0,0,0,0,0,0,0,0,0,0,0,0,0,0,0,0,0,0]
[378,1,1,0,0,0,0,0,0,10559,0,0,10559,0.14099999999999999,10530.37,433537,0,0,433537,5.8049999999999997,433537.43,75894,0,0,75894,1.016,75878.39]
[381,1,1,0,0,0,0,0,0,29726.58,0,-896.29,28830.29,0.13500000000000001,28549.15,213376.67,0,-7490.01,205886.66,0.97199999999999998,205553.87,0,0,0,0,0,0]
[390,1,1,0,0,0,0,0,0,6940,0,0,6940,0.14499999999999999,6987.68,422457,0,0,422457,8.7669999999999995,422489.8,43176,0,0,43176,0.89600000000000002,43179.06]
[391,1,1,0,0,0,0,0,0,7567.74,0,0,7567.74,0.153,7587.96,287680.15999999997,0,0,287680.15999999997,5.8010000000000002,287697.81,37967.94,0,0,37967.94,0.76600000000000001,37989.4]
[392,1,0,0,0,0,0,0,0,0,0,0,0,0,0,0,0,0,0,0,0,0,0,0,0,0,0]
[393,1,0,0,0,0,0,0,0,0,0,0,0,0,0,0,0,0,0,0,0,0,0,0,0,0,0]
[394,1,0,0,0,0,0,0,0,0,0,0,0,0,0,0,0,0,0,0,0,0,0,0,0,0,0]
[395,1,0,0,0,0,0,0,0,0,0,0,0,0,0,0,0,0,0,0,0,0,0,0,0,0,0]
[402,1,1,0,0,0,0,0,0,4241,0,0,4241,0.14699999999999999,4259.71,72641,0,0,72641,2.5070000000000001,72646.84,38426,0,0,38426,1.327,38453.279999999999]
[403,1,1,0,0,0,0,0,0,6112,0,0,6112,0.14199999999999999,6112.58,77166,0,0,77166,1.7929999999999999,77182.05,25594,0,0,25594,0.59499999999999997,25612.560000000001]
[404,1,1,0,0,0,0,0,0,7717,0,0,7717,0.14499999999999999,7718.72,120073,0,0,120073,2.2559999999999998,120092.59,28392,0,0,28392,0.53400000000000003,28426.17]
[408,1,0,0,0,0,0,0,0,0,0,0,0,0,0,0,0,0,0,0,0,0,0,0,0,0,0]
[409,1,0,0,0,0,0,0,0,0,0,0,0,0,0,0,0,0,0,0,0,0,0,0,0,0,0]
[411,1,0,0,0,0,0,0,0,0,0,0,0,0,0,0,0,0,0,0,0,0,0,0,0,0,0]
[412,1,0,0,0,0,0,0,0,0,0,0,0,0,0,0,0,0,0,0,0,0,0,0,0,0,0]
[413,1,1,0,0,0,0,0,0,27293,0,0,27293,0.14799999999999999,27428.75,1923688,0,0,1923688,10.38,1923719.38,187307,0,0,187307,1.0109999999999999,187368.04]
[414,1,1,0,0,0,0,0,0,9093,0,0,9093,0.14599999999999999,9149.0499999999993,367080,0,0,367080,5.8579999999999997,367090.16,41367,0,0,41367,0.66100000000000003,41421.410000000003]
[415,1,1,0,0,0,0,0,0,3924,0,0,3924,0.14899999999999999,3940.8,149491,0,0,149491,5.6539999999999999,149538.85999999999,19044,0,0,19044,0.72099999999999997,19069.25]
[417,1,0,0,0,0,0,0,0,0,0,0,0,0,0,0,0,0,0,0,0,0,0,0,0,0,0]
[418,1,0,0,0,0,0,0,0,0,0,0,0,0,0,0,0,0,0,0,0,0,0,0,0,0,0]
[421,1,0,0,0,0,0,0,0,0,0,0,0,0,0,0,0,0,0,0,0,0,0,0,0,0,0]
[422,1,0,0,0,0,0,0,0,0,0,0,0,0,0,0,0,0,0,0,0,0,0,0,0,0,0]
[423,1,1,0,0,0,0,0,0,23884.77,0.23,0,23885,0.14299999999999999,23851.5,1334558.6299999999,0.37,0,1334559,8.0009999999999994,1334516.23,196157.28,-0.28000000000000003,0,196157,1.1759999999999999,196149.37]
[424,1,1,0,0,0,0,0,0,3899.01,-0.01,0,3899,0.14299999999999999,3908.97,102188.51,0.49,-2,102187,3.738,102179.8,34029.07,-7.0000000000000007E-2,-1,34028,1.2450000000000001,34032.6]
[425,1,0,0,0,0,0,0,0,0,0,0,0,0,0,0,0,0,0,0,0,0,0,0,0,0,0]
[426,1,0,0,0,0,0,0,0,0,0,0,0,0,0,0,0,0,0,0,0,0,0,0,0,0,0]
[427,1,0,0,0,0,0,0,0,0,0,0,0,0,0,0,0,0,0,0,0,0,0,0,0,0,0]
[432,1,1,0,0,0,0,0,0,5391.96,0,0,5391.96,0.155,5420.99,218535.37,0,0,218535.37,6.2489999999999997,218553.53,44682.6,0,0,44682.6,1.278,44696.98]
[435,1,1,0,0,0,0,0,0,7552.76,0,0,7552.76,0.14000000000000001,7587.97,144968.04,0,0,144968.04,2.6749999999999998,144984.47,35314.589999999997,0,0,35314.589999999997,0.65200000000000002,35338.269999999997]
[436,1,0,0,0,0,0,0,0,0,0,0,0,0,0,0,0,0,0,0,0,0,0,0,0,0,0]
[437,1,0,0,0,0,0,0,0,0,0,0,0,0,0,0,0,0,0,0,0,0,0,0,0,0,0]
[440,1,0,0,0,0,0,0,0,0,0,0,0,0,0,0,0,0,0,0,0,0,0,0,0,0,0]
[441,1,1,0,0,0,0,0,0,7651.78,0,0,7651.78,0.16400000000000001,7676.45,242679.72,0,0,242679.72,5.1859999999999999,242744.32000000001,28056.92,0,0,28056.92,0.6,28084.57]
[442,1,0,0,0,0,0,0,0,0,0,0,0,0,0,0,0,0,0,0,0,0,0,0,0,0,0]
[443,1,0,0,0,0,0,0,0,0,0,0,0,0,0,0,0,0,0,0,0,0,0,0,0,0,0]
[444,1,0,0,0,0,0,0,0,0,0,0,0,0,0,0,0,0,0,0,0,0,0,0,0,0,0]
[446,1,0,0,0,0,0,0,0,0,0,0,0,0,0,0,0,0,0,0,0,0,0,0,0,0,0]
[447,1,1,107787.26,0,0,107787.26,6.3680000000000003,107797.44,2326.44,0,0,2326.44,0.13800000000000001,2336.06,83444.78,0,0,83444.78,4.93,83454.990000000005,14015.44,0,0,14015.44,0.82799999999999996,14016.38]
[451,1,0,0,0,0,0,0,0,0,0,0,0,0,0,0,0,0,0,0,0,0,0,0,0,0,0]
[453,1,0,0,0,0,0,0,0,0,0,0,0,0,0,0,0,0,0,0,0,0,0,0,0,0,0]
[454,1,0,0,0,0,0,0,0,0,0,0,0,0,0,0,0,0,0,0,0,0,0,0,0,0,0]
[456,1,0,0,0,0,0,0,0,0,0,0,0,0,0,0,0,0,0,0,0,0,0,0,0,0,0]
[457,1,0,0,0,0,0,0,0,0,0,0,0,0,0,0,0,0,0,0,0,0,0,0,0,0,0]
[458,1,1,125000,0,0,125000,1.95,124979.48,9974.61,0,0,9974.61,0.156,9998.36,109707.64,0,0,109707.64,1.712,109725.57,45514.76,0,0,45514.76,0.71,45505.35]
[459,1,0,0,0,0,0,0,0,0,0,0,0,0,0,0,0,0,0,0,0,0,0,0,0,0,0]
[460,1,0,0,0,0,0,0,0,0,0,0,0,0,0,0,0,0,0,0,0,0,0,0,0,0,0]
[461,1,0,0,0,0,0,0,0,0,0,0,0,0,0,0,0,0,0,0,0,0,0,0,0,0,0]
[463,1,1,0,0,0,0,0,0,7465.61,0,0,7465.61,0.14199999999999999,7479.51,143725.76999999999,0,0,143725.76999999999,2.7290000000000001,143743.47,58261.63,0,0,58261.63,1.107,58308.55]
[464,1,0,0,0,0,0,0,0,0,0,0,0,0,0,0,0,0,0,0,0,0,0,0,0,0,0]
[465,1,1,0,0,0,0,0,0,16145.33,0,0,16145.33,0.13200000000000001,16220.99,715089.54,0,0,715089.54,5.82,715197.98,170471.39,0,0,170471.39,1.3879999999999999,170566.12]
[466,1,1,0,0,0,0,0,0,14163.35,0,0,14163.35,0.13500000000000001,14080.79,582940.4,0,0,582940.4,5.59,583049.13,140565.09,0,0,140565.09,1.3480000000000001,140599.32999999999]
[473,1,1,195000,0,0,195000,3.8780000000000001,195005.7,7186,0,0,7186,0.14299999999999999,7190.77,235328,0,0,235328,4.681,235384.65,44046,0,0,44046,0.876,44049.77]
[477,1,1,0,0,0,0,0,0,22146,0,0,22146,0.14599999999999999,22185.88,1304473,0,0,1304473,8.5850000000000009,1304559.8600000001,324900,0,0,324900,2.1389999999999998,325038.27]
[480,1,1,0,0,0,0,0,0,9859,0,0,9859,0.14599999999999999,9864.51,329053,0,0,329053,4.8710000000000004,329109.84999999998,70746,0,0,70746,1.048,70808.28]
[482,1,1,0,0,0,0,0,0,18306,0,0,18306,0.14299999999999999,18306.04,562351,0,0,562351,4.4009999999999998,562351.03,200945,0,0,200945,1.573,200945.02]
[483,1,0,0,0,0,0,0,0,0,0,0,0,0,0,0,0,0,0,0,0,0,0,0,0,0,0]
[484,1,1,0,0,0,0,0,0,6878,0,0,6878,0.14599999999999999,6878.02,534000,0,0,534000,11.355,533999.99,59440,0,0,59440,1.264,59440]
[485,1,1,0,0,0,0,0,0,4916,0,0,4916,0.14000000000000001,4916,156730,0,0,156730,4.4489999999999998,156730,42950,0,0,42950,1.2190000000000001,42950]
[486,1,1,0,0,0,0,0,0,3156,0,0,3156,0.14599999999999999,3156.01,109014,0,0,109014,5.048,109014.01,20997,0,0,20997,0.97199999999999998,20997]
[487,1,1,0,0,0,0,0,0,2457,0,0,2457,0.14299999999999999,2457.0100000000002,71837,0,0,71837,4.1909999999999998,71837,22706,0,0,22706,1.325,22706]
[492,1,1,0,0,0,0,0,0,22953.91,0.09,0,22954,0.13600000000000001,23080.54,1923239.51,0.49,0,1923240,11.372999999999999,1934302.44,252221.13,-0.13,0,252221,1.4950000000000001,254192.11]
[495,1,1,0,0,0,0,0,0,6301.38,-0.38,0,6301,0.14199999999999999,6295.21,172650.99,0.01,0,172651,3.887,172563.21,24411.8,0.2,0,24412,0.55000000000000004,24398.58]
[497,1,1,0,0,0,0,0,0,3532.32,0,0,3532.32,0.14799999999999999,3531.86,39556.39,0,0,39556.39,1.6579999999999999,39550.400000000001,19453.09,0,0,19453.09,0.81499999999999995,19452.93]
[499,1,1,0,0,0,0,0,0,7254.17,0,0,7254.17,0.14899999999999999,7249.32,480137.32,0,0,480137.32,9.8819999999999997,480136.11,96296.94,0,0,96296.94,1.982,96296.4]
[500,1,1,0,0,0,0,0,0,12822.64,0.36,0,12823,0.151,12823,369176.15,-0.15,0,369176,4.3419999999999996,369175.93,60297.24,-0.24,0,60297,0.70899999999999996,60296.59]
[504,1,0,0,0,0,0,0,0,0,0,0,0,0,0,0,0,0,0,0,0,0,0,0,0,0,0]
[505,1,1,0,0,0,0,0,0,9628.98,0,0,9628.98,0.12,9630.0300000000007,290395.87,0,0,290395.87,3.6190000000000002,290425.55,42091.89,0,0,42091.89,0.52500000000000002,42131.37]
[507,1,1,0,0,0,0,0,0,8858.51,0,0,8858.51,0.14299999999999999,8858.49,182231.99,0,0,182231.99,2.9409999999999998,182233.05,41915.040000000001,0,0,41915.040000000001,0.67600000000000005,41915.15]
[508,1,1,0,0,0,0,0,0,16700.63,0,0,16700.63,0.14099999999999999,16668.810000000001,1196271.31,0,0,1196271.31,10.119,1196252.8,160576.66,0,0,160576.66,1.3580000000000001,160540.70000000001]
[511,1,1,0,0,0,0,0,0,9756.11,0,0,9756.11,0.13,9822.41,344528.63,0,0,344528.63,4.5599999999999996,344540.01,40862.019999999997,0,0,40862.019999999997,0.54100000000000004,40876.35]
[513,1,0,0,0,0,0,0,0,0,0,0,0,0,0,0,0,0,0,0,0,0,0,0,0,0,0]
[514,1,1,0,0,0,0,0,0,4593.3500000000004,0,0,4593.3500000000004,0.13,4608.74,89288.86,0,0,89288.86,2.5190000000000001,89303.11,17984.330000000002,0,0,17984.330000000002,0.50800000000000001,18009.52]
[516,1,0,0,0,0,0,0,0,0,0,0,0,0,0,0,0,0,0,0,0,0,0,0,0,0,0]
[518,1,1,0,0,0,0,0,0,25031.43,0,0,25031.43,0.13200000000000001,25115.81,1298137.1000000001,0,0,1298137.1000000001,6.8230000000000004,1298221.08,182043.82,0,0,182043.82,0.95699999999999996,182089.63]
[521,1,0,0,0,0,0,0,0,0,0,0,0,0,0,0,0,0,0,0,0,0,0,0,0,0,0]
[522,1,0,0,0,0,0,0,0,0,0,0,0,0,0,0,0,0,0,0,0,0,0,0,0,0,0]
[523,1,0,0,0,0,0,0,0,0,0,0,0,0,0,0,0,0,0,0,0,0,0,0,0,0,0]
[524,1,0,0,0,0,0,0,0,0,0,0,0,0,0,0,0,0,0,0,0,0,0,0,0,0,0]
[525,1,0,0,0,0,0,0,0,0,0,0,0,0,0,0,0,0,0,0,0,0,0,0,0,0,0]
[526,1,0,0,0,0,0,0,0,0,0,0,0,0,0,0,0,0,0,0,0,0,0,0,0,0,0]
[531,1,1,0,0,0,0,0,0,13080,0,0,13080,0.14399999999999999,13077.23,463904,0,0,463904,5.1079999999999997,463878.52,108573,0,0,108573,1.196,108613.69]
[533,1,1,0,0,0,0,0,0,8595,0,0,8595,0.159,8600.09,238550,0,0,238550,4.41,238530.86,55694,0,0,55694,1.03,55711.29]
[534,1,1,0,0,0,0,0,0,15033,0,0,15033,0.14199999999999999,15026.39,701361,0,0,701361,6.6260000000000003,701161,115692,0,0,115692,1.093,115660.88]
[535,1,1,0,0,0,0,0,0,196629,0,0,196629,0.13800000000000001,196648.11,14235023,0,0,14235023,9.99,14235613.439999999,2004241,0,0,2004241,1.407,2004955.77]
[542,1,1,283812.3,0,0,283812.3,2.23,283853.03999999998,18290.599999999999,0,0,18290.599999999999,0.14399999999999999,18329.52,346301.15,0,0,346301.15,2.7210000000000001,346351.63,53191.61,0,0,53191.61,0.41799999999999998,53206.53]
[543,1,0,0,0,0,0,0,0,0,0,0,0,0,0,0,0,0,0,0,0,0,0,0,0,0,0]
[544,1,1,0,0,0,0,0,0,29139,0,0,29139,0.14599999999999999,29171.41,1185810.19,0,0,1185810.19,5.9349999999999996,1185837.75,271627.67,0,0,271627.67,1.359,271533.87]
[545,1,1,215458.55,0,0,215458.55,4.7489999999999997,215449.45,6589.23,0,0,6589.23,0.14499999999999999,6578.26,126594.7,0,0,126594.7,2.79,126574.85,39997.089999999997,0,0,39997.089999999997,0.88200000000000001,40013.99]
[547,1,1,76000,0,0,76000,1.9430000000000001,76016.509999999995,5489.03,0,0,5489.03,0.14000000000000001,5477.26,187746.69,0,0,187746.69,4.7990000000000004,187752.57,37624.93,0,0,37624.93,0.96199999999999997,37636.589999999997]
[548,1,1,0,0,0,0,0,0,25273.32,0,0,25273.32,0.15,25194.5,557145.37,0,0,557145.37,3.3170000000000002,557134.37,110076.15,0,0,110076.15,0.65500000000000003,110015.98]
[549,1,1,454433.8,0,0,454433.8,2.3530000000000002,454494.54,27161.19,0,0,27161.19,0.14099999999999999,27234.9,977457.71,0,0,977457.71,5.0599999999999996,977366.07,139346.54999999999,0,0,139346.54999999999,0.72099999999999997,139265.01]
[550,1,1,0,0,0,0,0,0,4665.49,0,0,4665.49,0.13900000000000001,4673.97,143418.12,0,0,143418.12,4.2649999999999997,143413.57,30568.02,0,0,30568.02,0.90900000000000003,30565.75]
[553,1,1,0,0,0,0,0,0,4720.93,0,0,4720.93,0.14499999999999999,4709,90106.45,0,0,90106.45,2.7749999999999999,90120.57,43568.62,0,0,43568.62,1.3420000000000001,43582.63]
[561,1,1,0,0,0,0,0,0,3222.04,0,0,3222.04,0.156,3224.56,97567.35,0,0,97567.35,4.72,97563.53,16110.41,0,0,16110.41,0.77900000000000003,16102.12]
[564,1,1,0,0,0,0,0,0,18994.439999999999,0,0,18994.439999999999,0.14499999999999999,18960.990000000002,916235.7,0,0,916235.7,7.0069999999999997,916273.44,162855.72,0,0,162855.72,1.2450000000000001,162802.97]
[566,1,0,0,0,0,0,0,0,0,0,0,0,0,0,0,0,0,0,0,0,0,0,0,0,0,0]
[570,1,0,0,0,0,0,0,0,0,0,0,0,0,0,0,0,0,0,0,0,0,0,0,0,0,0]
[573,1,0,0,0,0,0,0,0,0,0,0,0,0,0,0,0,0,0,0,0,0,0,0,0,0,0]
[576,1,0,0,0,0,0,0,0,0,0,0,0,0,0,0,0,0,0,0,0,0,0,0,0,0,0]
[577,1,1,0,0,0,0,0,0,4800.09,0,0,4800.09,0.14299999999999999,4816.03,152342.74,0,0,152342.74,4.5229999999999997,152327.85999999999,39715.72,0,0,39715.72,1.179,39706.949999999997]
[578,1,1,0,0,0,0,0,0,11964.09,0,0,11964.09,0.13900000000000001,11945.19,781457.68,0,0,781457.68,9.093,781421.69,111692.22,0,0,111692.22,1.3,111717.61]
[581,1,1,0,0,0,0,0,0,7080.69,0,0,7080.69,0.14000000000000001,7095.29,273688.51,0,0,273688.51,5.4020000000000001,273776.93,33319.19,0,0,33319.19,0.65800000000000003,33347.870000000003]
[582,1,0,0,0,0,0,0,0,0,0,0,0,0,0,0,0,0,0,0,0,0,0,0,0,0,0]
[583,1,0,0,0,0,0,0,0,0,0,0,0,0,0,0,0,0,0,0,0,0,0,0,0,0,0]
[584,1,0,0,0,0,0,0,0,0,0,0,0,0,0,0,0,0,0,0,0,0,0,0,0,0,0]
[592,1,1,0,0,0,0,0,0,4806.8100000000004,0,0,4806.8100000000004,0.151,4821.07,103395.22,0,0,103395.22,3.238,103381.57,18559.12,0,0,18559.12,0.58099999999999996,18549.939999999999]
[593,1,1,0,0,0,0,0,0,17067.45,0,0,17067.45,0.151,17055.95,549281.21,0,0,549281.21,4.8620000000000001,549179.09,154306.94,0,0,154306.94,1.3660000000000001,154294.25]
[595,1,1,0,0,0,0,0,0,18573.150000000001,0,0,18573.150000000001,0.14599999999999999,18573,893693.33,0,0,893693.33,7.04,893695.69,132961.39000000001,0,0,132961.39000000001,1.0469999999999999,132961]
[597,1,0,0,0,0,0,0,0,0,0,0,0,0,0,0,0,0,0,0,0,0,0,0,0,0,0]
[599,1,1,0,0,0,0,0,0,7854.57,0,0,7854.57,0.15,7852.68,257822.49,0,0,257822.49,4.9249999999999998,257829.61,42006.71,0,0,42006.71,0.80200000000000005,41985.65]
[600,1,1,262077.53,0,0,262077.53,5.944,262076.82,7425.88,0,0,7425.88,0.16800000000000001,7425.99,146135.9,0,0,146135.9,3.3140000000000001,146135.9,24760.77,0,0,24760.77,0.56200000000000006,24760.98]
[601,1,1,0,0,0,0,0,0,5688.22,0,0,5688.22,0.14799999999999999,5672.73,297230.28999999998,0,0,297230.28999999998,7.7549999999999999,297243.64,40415.24,0,0,40415.24,1.054,40399.07]
[603,1,0,0,0,0,0,0,0,0,0,0,0,0,0,0,0,0,0,0,0,0,0,0,0,0,0]
[604,1,0,0,0,0,0,0,0,0,0,0,0,0,0,0,0,0,0,0,0,0,0,0,0,0,0]
[611,1,0,0,0,0,0,0,0,0,0,0,0,0,0,0,0,0,0,0,0,0,0,0,0,0,0]
[612,1,0,0,0,0,0,0,0,0,0,0,0,0,0,0,0,0,0,0,0,0,0,0,0,0,0]
[614,1,0,0,0,0,0,0,0,0,0,0,0,0,0,0,0,0,0,0,0,0,0,0,0,0,0]
[615,1,0,0,0,0,0,0,0,0,0,0,0,0,0,0,0,0,0,0,0,0,0,0,0,0,0]
[621,1,1,0,0,0,0,0,0,134611,0,-14520,120091,0.14000000000000001,120091,10137115,0,-1093466,9043649,10.532,9043649,1017975,0,-109806,908169,1.0580000000000001,908168.99]
[622,1,1,0,0,0,0,0,0,123393,0,-19386,104007,0.13900000000000001,104006.98,14978212,0,-2353344,12624868,16.87,12624865.970000001,1406406,0,-220971,1185435,1.5840000000000001,1185434.81]
[623,1,1,0,0,0,0,0,0,90754,0,-11053,79701,0.13600000000000001,79701,7266281,0,-884969,6381312,10.856,6381312.0999999996,936570,0,-114066,822504,1.399,822504.01]
[624,1,1,1598135,0,-178675,1419460,2.0459999999999998,1419460.01,104719,0,-11708,93011,0.13400000000000001,93011,4865288,0,-543950,4321338,6.2279999999999998,4321338.0599999996,907449,0,-101455,805994,1.161,805994.01]
[625,1,1,0,0,0,0,0,0,365952,0,-78401,287551,0.13600000000000001,287551,69613923,0,-14913931,54699992,25.806999999999999,54699992.240000002,3406163,0,-729729,2676434,1.2629999999999999,2676434]
[627,1,0,0,0,0,0,0,0,0,0,0,0,0,0,0,0,0,0,0,0,0,0,0,0,0,0]
[628,1,0,0,0,0,0,0,0,0,0,0,0,0,0,0,0,0,0,0,0,0,0,0,0,0,0]
[630,1,1,0,0,0,0,0,0,2865,0,0,2865,0.14000000000000001,2884.57,412708,0,0,412708,20.030999999999999,412720.13,29057,0,0,29057,1.411,29072.34]
[631,1,0,0,0,0,0,0,0,0,0,0,0,0,0,0,0,0,0,0,0,0,0,0,0,0,0]
[633,1,0,0,0,0,0,0,0,0,0,0,0,0,0,0,0,0,0,0,0,0,0,0,0,0,0]
[635,1,1,0,0,0,0,0,0,5221,0,0,5221,0.161,5240.2700000000004,40472,0,0,40472,1.2450000000000001,40522.57,21923,0,0,21923,0.67400000000000004,21937.52]
[636,1,0,0,0,0,0,0,0,0,0,0,0,0,0,0,0,0,0,0,0,0,0,0,0,0,0]
[637,1,0,0,0,0,0,0,0,0,0,0,0,0,0,0,0,0,0,0,0,0,0,0,0,0,0]
[638,1,0,0,0,0,0,0,0,0,0,0,0,0,0,0,0,0,0,0,0,0,0,0,0,0,0]
[640,1,1,0,0,0,0,0,0,12223,0,0,12223,0.152,12229.61,281175,0,0,281175,3.4950000000000001,281200.57,47269,0,0,47269,0.58799999999999997,47309.279999999999]
[641,1,0,0,0,0,0,0,0,0,0,0,0,0,0,0,0,0,0,0,0,0,0,0,0,0,0]
[646,1,0,0,0,0,0,0,0,0,0,0,0,0,0,0,0,0,0,0,0,0,0,0,0,0,0]
[647,1,0,0,0,0,0,0,0,0,0,0,0,0,0,0,0,0,0,0,0,0,0,0,0,0,0]
[648,1,0,0,0,0,0,0,0,0,0,0,0,0,0,0,0,0,0,0,0,0,0,0,0,0,0]
[649,1,0,0,0,0,0,0,0,0,0,0,0,0,0,0,0,0,0,0,0,0,0,0,0,0,0]
[650,1,0,0,0,0,0,0,0,0,0,0,0,0,0,0,0,0,0,0,0,0,0,0,0,0,0]
[651,1,0,0,0,0,0,0,0,0,0,0,0,0,0,0,0,0,0,0,0,0,0,0,0,0,0]
[652,1,0,0,0,0,0,0,0,0,0,0,0,0,0,0,0,0,0,0,0,0,0,0,0,0,0]
[653,1,0,0,0,0,0,0,0,0,0,0,0,0,0,0,0,0,0,0,0,0,0,0,0,0,0]
[654,1,0,0,0,0,0,0,0,0,0,0,0,0,0,0,0,0,0,0,0,0,0,0,0,0,0]
[655,1,0,0,0,0,0,0,0,0,0,0,0,0,0,0,0,0,0,0,0,0,0,0,0,0,0]
[656,1,1,0,0,0,0,0,0,35025.46,0,0,35025.46,0.13400000000000001,35148.18,3065302.45,0,0,3065302.45,11.686,3065235.93,349643.03,0,0,349643.03,1.333,349645.69]
[657,1,0,0,0,0,0,0,0,0,0,0,0,0,0,0,0,0,0,0,0,0,0,0,0,0,0]
[659,1,1,750000,0,-2620.86,747379.14,2.8420000000000001,747402.94,36641.410000000003,0,-128.04,36513.370000000003,0.13900000000000001,36554.89,2013281.2,0,-7035.37,2006245.83,7.6289999999999996,2006311.42,401904.62,0,-1404.45,400500.17,1.5229999999999999,400525.93]
[669,1,0,0,0,0,0,0,0,0,0,0,0,0,0,0,0,0,0,0,0,0,0,0,0,0,0]
[670,1,0,0,0,0,0,0,0,0,0,0,0,0,0,0,0,0,0,0,0,0,0,0,0,0,0]
[671,1,1,0,0,0,0,0,0,10281,0,0,10281,0.14399999999999999,10309.780000000001,231607,0,0,231607,3.2349999999999999,231612.06,34428,0,0,34428,0.48099999999999998,34437.53]
[676,1,1,45578,0,0,45578,4.9409999999999998,45577.02,1270,0,0,1270,0.13800000000000001,1272.95,57657,0,0,57657,6.2510000000000003,57660.79,11505,0,0,11505,1.2470000000000001,11502.64]
[678,1,0,0,0,0,0,0,0,0,0,0,0,0,0,0,0,0,0,0,0,0,0,0,0,0,0]
[682,1,1,0,0,0,0,0,0,8157,0,0,8157,0.14699999999999999,8183.95,498140,0,0,498140,8.9480000000000004,498162.99,100897,0,0,100897,1.8120000000000001,100879.67999999999]
[690,1,1,0,0,0,0,0,0,6913,0,0,6913,0.14399999999999999,6906.05,328743,0,0,328743,6.8550000000000004,328756.89,62849,0,0,62849,1.31,62825.9]
[691,1,0,0,0,0,0,0,0,0,0,0,0,0,0,0,0,0,0,0,0,0,0,0,0,0,0]
[692,1,0,0,0,0,0,0,0,0,0,0,0,0,0,0,0,0,0,0,0,0,0,0,0,0,0]
[693,1,0,0,0,0,0,0,0,0,0,0,0,0,0,0,0,0,0,0,0,0,0,0,0,0,0]
[695,1,1,0,0,0,0,0,0,3840.77,0,0,3840.77,0.20799999999999999,3847.64,4155.5600000000004,0,-1855.57,2299.9899999999998,0.124,2293.79,0,0,0,0,0,0]
[696,1,1,0,0,0,0,0,0,9972.66,0,0,9972.66,0.16,9945.18,737255.08,0,-62501.87,674753.21,10.856,674780.73,15559.36,0,-1319.06,14240.3,0.22900000000000001,14234.04]
[697,1,0,0,0,0,0,0,0,0,0,0,0,0,0,0,0,0,0,0,0,0,0,0,0,0,0]
[698,1,1,0,0,0,0,0,0,6339.21,0,0,6339.21,0.124,6342.81,88822.96,0,0,88822.96,1.736,88799.35,28238.58,0,0,28238.58,0.55200000000000005,28235.74]
[699,1,0,0,0,0,0,0,0,0,0,0,0,0,0,0,0,0,0,0,0,0,0,0,0,0,0]
[700,1,1,0,0,0,0,0,0,22230.15,0,0,22230.15,0.14899999999999999,22209.64,876014.63,0,0,876014.63,5.8769999999999998,876013.92,159560.28,0,0,159560.28,1.07,159492.07]
[701,1,1,0,0,0,0,0,0,15480.17,0,0,15480.17,0.16600000000000001,15436.07,1041808.23,0,-233812.31,807995.92,8.6890000000000001,807975.86,0,0,0,0,0,0]
[704,1,1,0,0,0,0,0,0,15735.96,0,0,15735.96,0.14299999999999999,15767.54,957843.76,0,0,957843.76,8.6869999999999994,957850.25,145538.75,0,0,145538.75,1.32,145546.49]
[706,1,1,0,0,0,0,0,0,8438.17,0,0,8438.17,0.16300000000000001,8416.68,59575.43,0,-16789.18,42786.25,0.82899999999999996,42806.29,0,0,0,0,0,0]
[707,1,1,0,0,0,0,0,0,167.59,0,0,167.59,0.155,167.59,34425.599999999999,0,0,34425.599999999999,31.838999999999999,34425.599999999999,1513.74,0,0,1513.74,1.4,1513.74]
[708,1,0,0,0,0,0,0,0,0,0,0,0,0,0,0,0,0,0,0,0,0,0,0,0,0,0]
[709,1,1,0,0,0,0,0,0,108601.18,0,0,108601.18,0.14299999999999999,108539.81,4822897.68,0,0,4822897.68,6.3540000000000001,4822810.9800000004,1028841.53,0,0,1028841.53,1.355,1028471.65]
[710,1,0,0,0,0,0,0,0,0,0,0,0,0,0,0,0,0,0,0,0,0,0,0,0,0,0]
[712,1,1,0,0,0,0,0,0,5605.62,0,0,5605.62,0.161,5593.79,0,0,0,0,0,0,0,0,0,0,0,0]
[716,1,1,0,0,0,0,0,0,14789,0,-1806.09,12982.91,0.13200000000000001,12983,688123,0,-84045.72,604077.28,6.1529999999999996,604077,113884,0,-13909.87,99974.13,1.018,99974]
[717,1,1,0,0,0,0,0,0,17102,0,-2260,14842,0.14000000000000001,14842,672967,0,-88928,584039,5.4980000000000002,584039,133472,0,-17638,115834,1.0900000000000001,115834]
[719,1,1,0,0,0,0,0,0,76038,0,-6852,69186,0.13900000000000001,69186,3108526,0,-280109,2828417,5.702,2828417,643470,0,-57983,585487,1.18,585487]
[720,1,1,3011717,0,-352741,2658976,5.4320000000000004,2658976,74895,0,-8772,66123,0.13500000000000001,66123,4644540,0,-543982,4100558,8.3780000000000001,4100558,586043,0,-68639,517404,1.0569999999999999,517404]
[721,1,1,0,0,0,0,0,0,31688,0,-1017,30671,0.13900000000000001,30671,792631,0,-25447,767184,3.484,767184,292240,0,-9382,282858,1.2849999999999999,282858]
[726,1,1,445655.63,0,0,445655.63,1.881,445704.14,32998.49,0,0,32998.49,0.13900000000000001,32936.14,1260299.03,0,0,1260299.03,5.319,1260340.3999999999,203368.14,0,0,203368.14,0.85799999999999998,203303.64]
[727,1,1,417634.88,0,0,417634.88,3.0859999999999999,417638.53,19284.759999999998,0,0,19284.759999999998,0.14199999999999999,19217.330000000002,776723.67,0,0,776723.67,5.7389999999999999,776677.75,307160.68,0,0,307160.68,2.2690000000000001,307071.24]
[728,1,1,0,0,0,0,0,0,106038.31,0,-2776.01,103262.3,0.14299999999999999,103081.1,3792661.89,0,-99289.16,3693372.73,5.1239999999999997,3693619.31,982407.8,0,-25718.73,956689.07,1.327,956563.78]
[731,1,0,0,0,0,0,0,0,0,0,0,0,0,0,0,0,0,0,0,0,0,0,0,0,0,0]
[732,1,0,0,0,0,0,0,0,0,0,0,0,0,0,0,0,0,0,0,0,0,0,0,0,0,0]
[733,1,0,0,0,0,0,0,0,0,0,0,0,0,0,0,0,0,0,0,0,0,0,0,0,0,0]
[734,1,0,0,0,0,0,0,0,0,0,0,0,0,0,0,0,0,0,0,0,0,0,0,0,0,0]
[735,1,0,0,0,0,0,0,0,0,0,0,0,0,0,0,0,0,0,0,0,0,0,0,0,0,0]
[736,1,0,0,0,0,0,0,0,0,0,0,0,0,0,0,0,0,0,0,0,0,0,0,0,0,0]
[737,1,0,0,0,0,0,0,0,0,0,0,0,0,0,0,0,0,0,0,0,0,0,0,0,0,0]
[738,1,1,0,0,0,0,0,0,6041,0,0,6041,0.14199999999999999,6041,704682,0,0,704682,16.523,704682,60551,0,0,60551,1.42,60551]
[739,1,1,0,0,0,0,0,0,7409,0,0,7409,0.14199999999999999,7409,364427,0,0,364427,6.9939999999999998,364427,65610,0,0,65610,1.26,65610]
[740,1,1,0,0,0,0,0,0,14060,0,0,14060,0.15,14060,680834,0,0,680834,7.2430000000000003,680834,106318,0,0,106318,1.131,106318]
[741,1,1,263787,0,0,263787,3.28,263787,11908,0,0,11908,0.14799999999999999,11908,361231,0,0,361231,4.492,361231,89531,0,0,89531,1.113,89531]
[742,1,1,0,0,0,0,0,0,112518,0,0,112518,0.14499999999999999,112518,9605697,0,0,9605697,12.351000000000001,9605697,1275180,0,0,1275180,1.64,1275180]
[743,1,1,215248,0,0,215248,2.2749999999999999,215248,14337,0,0,14337,0.152,14337,496902,0,0,496902,5.2510000000000003,496902,97792,0,0,97792,1.0329999999999999,97792]
[745,1,1,0,0,0,0,0,0,12041,0,0,12041,0.13200000000000001,12041,668865,0,0,668865,7.3540000000000001,668865,130503,0,0,130503,1.4350000000000001,130503]
[748,1,1,0,0,0,0,0,0,22191,0,0,22191,0.14299999999999999,22191,833175,0,0,833175,5.3710000000000004,833175,188243,0,0,188243,1.2130000000000001,188243]
[750,1,1,0,0,0,0,0,0,20296,0,0,20296,0.14899999999999999,20296,1245350,0,0,1245350,9.1470000000000002,1245350,149985,0,0,149985,1.101,149985]
[756,1,1,0,0,0,0,0,0,10795,0,0,10795,0.14699999999999999,10834.72,369099,0,0,369099,5.008,369117.39,48632,0,0,48632,0.66,48645.66]
[761,1,1,0,0,0,0,0,0,39654,0,0,39654,0.14199999999999999,39815.85,2249339,0,0,2249339,8.0229999999999997,2249595.4500000002,309881,0,0,309881,1.1060000000000001,310114.99]
[762,1,0,0,0,0,0,0,0,0,0,0,0,0,0,0,0,0,0,0,0,0,0,0,0,0,0]
[763,1,1,0,0,0,0,0,0,5845,0,0,5845,0.13800000000000001,5868.25,159426,0,0,159426,3.75,159463.31,36395,0,0,36395,0.85599999999999998,36400.160000000003]
[768,1,1,0,0,0,0,0,0,4603.3500000000004,0,0,4603.3500000000004,0.14399999999999999,4621.3100000000004,102597,0,0,102597,4.4800000000000004,143774.13,21969.06,0,0,21969.06,0.68500000000000005,21983.32]
[769,1,0,0,0,0,0,0,0,0,0,0,0,0,0,0,0,0,0,0,0,0,0,0,0,0,0]
[771,1,1,0,0,0,0,0,0,9273.2999999999993,0,0,9273.2999999999993,0.13900000000000001,9335.9599999999991,106922.01,0,0,106922.01,1.5940000000000001,107061.31,29526.31,0,0,29526.31,0.44,29552.68]
[775,1,1,0,0,0,0,0,0,12464,0,0,12464,0.14799999999999999,12494.93,378250,0,0,378250,4.4809999999999999,378309.41,46441,0,0,46441,0.55100000000000005,46518.3]
[777,1,1,0,0,0,0,0,0,19561,0,0,19561,0.14399999999999999,19667.73,667289,0,0,667289,4.8869999999999996,667473.55000000005,84232,0,0,84232,0.61699999999999999,84270.75]
[784,1,0,0,0,0,0,0,0,0,0,0,0,0,0,0,0,0,0,0,0,0,0,0,0,0,0]
[786,1,1,0,0,0,0,0,0,1949,0,0,1949,0.13800000000000001,1953.82,158104.46,0,0,158104.46,11.167999999999999,158118.10999999999,0,0,0,0,0,0]
[787,1,1,0,0,0,0,0,0,2498.9899999999998,0,0,2498.9899999999998,0.13600000000000001,2514.94,119149.46,0,0,119149.46,6.444,119163.8,22756.63,0,0,22756.63,1.2310000000000001,22763.91]
[789,1,0,0,0,0,0,0,0,0,0,0,0,0,0,0,0,0,0,0,0,0,0,0,0,0,0]
[790,1,0,0,0,0,0,0,0,0,0,0,0,0,0,0,0,0,0,0,0,0,0,0,0,0,0]
[791,1,0,0,0,0,0,0,0,0,0,0,0,0,0,0,0,0,0,0,0,0,0,0,0,0,0]
[792,1,0,0,0,0,0,0,0,0,0,0,0,0,0,0,0,0,0,0,0,0,0,0,0,0,0]
[793,1,0,0,0,0,0,0,0,0,0,0,0,0,0,0,0,0,0,0,0,0,0,0,0,0,0]
[801,1,1,0,0,0,0,0,0,2673.58,-0.57999999999999996,0,2673,0.188,2683.36,66535.66,0.34,0,66536,4.6630000000000003,66555.929999999993,16526.12,-0.12,0,16526,1.1579999999999999,16528.37]
[803,1,1,0,0,0,0,0,0,14874.1,-0.1,0,14874,0.17599999999999999,14903.3,251643.03,-0.03,0,251643,2.972,251662.6,32931.51,0.49,0,32932,0.38900000000000001,32939.69]
[806,1,0,0,0,0,0,0,0,0,0,0,0,0,0,0,0,0,0,0,0,0,0,0,0,0,0]
[809,1,0,0,0,0,0,0,0,0,0,0,0,0,0,0,0,0,0,0,0,0,0,0,0,0,0]
[810,1,0,0,0,0,0,0,0,0,0,0,0,0,0,0,0,0,0,0,0,0,0,0,0,0,0]
[811,1,1,0,0,0,0,0,0,9210,0,0,9210,0.14099999999999999,9227.49,241310,0,0,241310,3.6869999999999998,241289,75658,0,0,75658,1.1559999999999999,75652.320000000007]
[813,1,1,0,0,0,0,0,0,15536,0,0,15536,0.13700000000000001,15538.07,595500.66,0,0,595500.66,5.2510000000000003,595550.30000000005,118531,0,0,118531,1.0449999999999999,118520.29]
[815,2,1,34980.03,0,0,34980.03,2.3719999999999999,35008.82,0,0,0,0,0,0,449.2,0,0,449.2,3.1E-2,457.54,7239.82,0,0,7239.82,0.49099999999999999,7246.77]
[818,1,1,0,0,0,0,0,0,1997,0,0,1997,0.13900000000000001,2007.4,10209,0,0,10209,0.70699999999999996,10210.280000000001,18078,0,0,18078,1.252,18081.009999999998]
[819,1,0,0,0,0,0,0,0,0,0,0,0,0,0,0,0,0,0,0,0,0,0,0,0,0,0]
[820,1,1,0,0,0,0,0,0,3742,0,0,3742,0.14699999999999999,3760.26,212607,0,0,212607,8.3119999999999994,212620.71,33313,0,0,33313,1.3029999999999999,33330.699999999997]
[821,1,1,0,0,0,0,0,0,4513,0,0,4513,0.14000000000000001,4516.26,513083,0,0,513083,15.906000000000001,513111.18,40635,0,0,40635,1.26,40646.300000000003]
[827,1,0,0,0,0,0,0,0,0,0,0,0,0,0,0,0,0,0,0,0,0,0,0,0,0,0]
[829,1,1,0,0,0,0,0,0,15704,0,0,15704,0.13800000000000001,15758.75,387840,0,0,387840,3.3959999999999999,387802.31,220609,0,0,220609,1.9319999999999999,220622.52]
[830,1,0,0,0,0,0,0,0,0,0,0,0,0,0,0,0,0,0,0,0,0,0,0,0,0,0]
[831,1,1,0,0,0,0,0,0,75069,0,-5966,69103,0.14199999999999999,69103,6151159,0,-488851,5662308,11.638999999999999,5662308,1059519,0,-84203,975316,2.0049999999999999,975316]
[832,1,1,618338,0,-36068,582270,2.66,582270,32530,0,-1897,30633,0.14000000000000001,30633,1787592,0,-104271,1683321,7.69,1683321,276088,0,-16104,259984,1.1879999999999999,259984]
[833,1,1,1176475,0,-144731,1031744,1.0620000000000001,1031744,149842,0,-18434,131408,0.13500000000000001,131408,7159553,0,-880772,6278781,6.4610000000000003,6278781,1442003,0,-177396,1264607,1.3009999999999999,1264606.99]
[834,1,1,0,0,0,0,0,0,132719,0,-8677,124042,0.13900000000000001,124041.99,8390827,0,-548577,7842250,8.7940000000000005,7842250,936688,0,-61239,875449,0.98199999999999998,875448.99]
[836,1,1,0,0,0,0,0,0,5855.82,0,0,5855.82,0.161,5849.08,180824.31,0,0,180824.31,4.9770000000000003,180812.82,26443.25,0,0,26443.25,0.72799999999999998,26448.01]
[837,1,1,0,0,0,0,0,0,9277.2900000000009,0,0,9277.2900000000009,0.153,9279.24,275741.75,0,0,275741.75,4.5469999999999997,275769.18,51550.1,0,0,51550.1,0.85,51551.31]
[840,1,1,0,0,0,0,0,0,16478.63,0,0,16478.63,0.17299999999999999,16525.439999999999,705857.78,0,0,705857.78,7.3890000000000002,705817.82,128921.4,0,0,128921.4,1.35,128955.75]
[846,1,1,0,0,0,0,0,0,15003.15,0,0,15003.15,0.156,15085.13,237184.82,0,0,237184.82,2.4529999999999998,237203.92,85496.960000000006,0,0,85496.960000000006,0.88500000000000001,85579.08]
[850,1,1,0,0,0,0,0,0,5062.92,0,0,5062.92,0.153,5094.95,69408.800000000003,0,0,69408.800000000003,2.085,69431.23,22970.2,0,0,22970.2,0.69,22977.24]
[852,1,1,0,0,0,0,0,0,12367.69,0,0,12367.69,0.17499999999999999,12384.95,93619.839999999997,0,0,93619.839999999997,1.323,93630.26,32101.71,0,0,32101.71,0.45400000000000001,32130.11]
[857,1,1,0,0,0,0,0,0,8156.98,0,0,8156.98,0.14399999999999999,8179.73,331109.67,0,0,331109.67,5.8289999999999997,331108.47999999998,65579.39,0,0,65579.39,1.1539999999999999,65551.41]
[858,1,1,0,0,0,0,0,0,9203.3700000000008,0,0,9203.3700000000008,0.14699999999999999,9234.0300000000007,552383.25,0,0,552383.25,8.7940000000000005,552408.48,80767.009999999995,0,0,80767.009999999995,1.286,80782.039999999994]
[861,1,1,1000000,0,0,1000000,3.286,999924.81,42855.1,0,0,42855.1,0.14099999999999999,42906.09,2311665.33,0,0,2311665.33,7.5960000000000001,2311451.25,514753.49,0,0,514753.49,1.6910000000000001,514568.73]
[876,1,1,0,0,0,0,0,0,22455,0,0,22455,0.14099999999999999,22493.3,1084149,0,0,1084149,6.7960000000000003,1084145.02,161408,0,0,161408,1.012,161441.25]
[877,1,1,0,0,0,0,0,0,45549,0,-582,44967,0.14299999999999999,44998.3,2760893,0,-35264,2725629,8.6620000000000008,2725701.34,488197,0,-6236,481961,1.532,482079.71]
[879,1,1,0,0,0,0,0,0,20934,0,-365,20569,0.14000000000000001,20554.48,1192064,0,-20785,1171279,7.9779999999999998,1171311.69,243210,0,-4241,238969,1.6279999999999999,239019.23]
[880,1,0,0,0,0,0,0,0,0,0,0,0,0,0,0,0,0,0,0,0,0,0,0,0,0,0]
[881,1,1,0,0,0,0,0,0,8147,0,0,8147,0.14099999999999999,8161.38,339239,0,0,339239,5.8609999999999998,339247.34,76291,0,0,76291,1.3180000000000001,76288.69]
[882,1,1,0,0,0,0,0,0,50168,0,0,50168,0.13900000000000001,50279.67,2345507,0,0,2345507,6.484,2345419.91,286141,0,0,286141,0.79100000000000004,286123.87]
[883,1,1,0,0,0,0,0,0,15524,0,-622,14902,0.14199999999999999,14906.35,601213,0,-24074,577139,5.4980000000000002,577148.81000000006,127506,0,-5106,122400,1.1659999999999999,122400.06]
[885,1,1,0,0,0,0,0,0,27880,0,0,27880,0.13900000000000001,27874.31,1227319,0,0,1227319,6.12,1227272,306577,0,0,306577,1.5289999999999999,306617.46000000002]
[891,1,1,0,0,0,0,0,0,11067.72,0,0,11067.72,0.13900000000000001,11127.59,349789.51,0,0,349789.51,4.37,349838.69,52452.25,0,0,52452.25,0.65500000000000003,52435.78]
[892,1,0,0,0,0,0,0,0,0,0,0,0,0,0,0,0,0,0,0,0,0,0,0,0,0,0]
[893,1,0,0,0,0,0,0,0,0,0,0,0,0,0,0,0,0,0,0,0,0,0,0,0,0,0]
[894,1,0,0,0,0,0,0,0,0,0,0,0,0,0,0,0,0,0,0,0,0,0,0,0,0,0]
[896,1,0,0,0,0,0,0,0,0,0,0,0,0,0,0,0,0,0,0,0,0,0,0,0,0,0]
[911,1,1,0,0,0,0,0,0,31286,0,0,31286,0.14499999999999999,31286,2114812,0,0,2114812,9.8209999999999997,2114812,351954,0,0,351954,1.635,351954]
[912,1,1,0,0,0,0,0,0,10309,0,0,10309,0.14299999999999999,10333.34,720119,0,0,720119,9.9659999999999993,720154.02,103470,0,0,103470,1.4319999999999999,103477.88]
[913,1,0,0,0,0,0,0,0,0,0,0,0,0,0,0,0,0,0,0,0,0,0,0,0,0,0]
[914,1,1,0,0,0,0,0,0,5730.21,0,0,5730.21,0.14799999999999999,5730,125696.24,0,0,125696.24,3.2559999999999998,125696,22705.66,0,0,22705.66,0.58799999999999997,22706]
[916,6,0,0,0,0,0,0,0,0,0,0,0,0,0,0,0,0,0,0,0,0,0,0,0,0,0]
[917,6,0,0,0,0,0,0,0,0,0,0,0,0,0,0,0,0,0,0,0,0,0,0,0,0,0]
[918,1,0,0,0,0,0,0,0,0,0,0,0,0,0,0,0,0,0,0,0,0,0,0,0,0,0]
[2071,1,1,175000,0,0,175000,1.512,174996.71,14444.86,0,0,14444.86,0.125,14447.99,519020.72,0,0,519020.72,4.4829999999999997,519016.43,85309.13,0,0,85309.13,0.73699999999999999,85310.32]
[2125,1,1,0,0,0,0,0,0,16201,0,0,16201,0.14699999999999999,16152,394937,0,0,394937,3.5939999999999999,394899.88,115866,0,0,115866,1.0549999999999999,115920.8]
[2134,1,1,0,0,0,0,0,0,19388.87,0,0,19388.87,0.14499999999999999,19446.61,250660.88,0,0,250660.88,1.869,250660.09,86615.89,0,0,86615.89,0.64600000000000002,86638]
[2135,1,1,0,0,0,0,0,0,17183.48,0,0,17183.48,0.13800000000000001,17183.759999999998,825603.16,0,0,825603.16,6.63,825605.02,91543.24,0,0,91543.24,0.73499999999999999,91547.11]
[2137,1,1,0,0,0,0,0,0,9999.18,0,0,9999.18,0.14799999999999999,10011.83,229304.92,0,0,229304.92,3.3889999999999998,229257.41,72451.520000000004,0,0,72451.520000000004,1.071,72450.48]
[2142,1,1,0,0,0,0,0,0,45464.45,0,-1646.12,43818.33,0.14299999999999999,43787.24,2663000.3199999998,0,-96418.1,2566582.2200000002,8.3819999999999997,2566606.12,0,0,0,0,0,0]
[2143,1,1,0,0,0,0,0,0,12394.6,0,0,12394.6,0.14000000000000001,12428.5,394800.7,0,0,394800.7,4.4470000000000001,394782.43,65785.16,0,0,65785.16,0.74099999999999999,65782.28]
[2144,1,1,0,0,0,0,0,0,28833.67,0,-67,28766.67,0.13700000000000001,28767.03,1780435.69,0,-4124,1776311.69,8.4700000000000006,1776313.69,276584.95,0,-641,275943.95,1.3160000000000001,275944.26]
[2148,1,0,0,0,0,0,0,0,0,0,0,0,0,0,0,0,0,0,0,0,0,0,0,0,0,0]
[2149,1,1,217361,0,0,217361,1.411,217427.54,21291,0,0,21291,0.13900000000000001,21419.15,691501,0,0,691501,4.4880000000000004,691576.74,145643,0,0,145643,0.94599999999999995,145773.53]
[2153,1,0,0,0,0,0,0,0,0,0,0,0,0,0,0,0,0,0,0,0,0,0,0,0,0,0]
[2154,1,1,0,0,0,0,0,0,7704.74,0,0,7704.74,0.182,7697.89,0,0,0,0,0,0,0,0,0,0,0,0]
[2155,1,1,0,0,0,0,0,0,6536,0,0,6536,0.14499999999999999,6578.97,309872,0,0,309872,6.83,309892.40000000002,73889,0,0,73889,1.629,73911.38]
[2159,1,1,0,0,0,0,0,0,18779.849999999999,0,0,18779.849999999999,0.14299999999999999,18912.11,369663.76,0,0,369663.76,2.7970000000000002,369910.33,65054.47,0,0,65054.47,0.49199999999999999,65068.24]
[2163,1,0,0,0,0,0,0,0,0,0,0,0,0,0,0,0,0,0,0,0,0,0,0,0,0,0]
[2164,1,1,0,0,0,0,0,0,15644.47,0,0,15644.47,0.16400000000000001,15644,394164.27,0,0,394164.27,4.1399999999999997,394164,87893.58,0,0,87893.58,0.92300000000000004,87894]
[2165,1,1,0,0,0,0,0,0,10153.870000000001,0,0,10153.870000000001,0.14299999999999999,10179.530000000001,432511.49,0,0,432511.49,6.0759999999999996,432523.04,75588.11,0,0,75588.11,1.0620000000000001,75598.990000000005]
[2167,1,1,0,0,0,0,0,0,10537,0,0,10537,0.13500000000000001,10611.74,277861,0,0,277861,3.5350000000000001,277870.34000000003,47793,0,0,47793,0.60899999999999999,47870.73]
[2168,1,1,0,0,0,0,0,0,14758,0,0,14758,0.13800000000000001,14707.68,340720,0,0,340720,3.1970000000000001,340727.82,61065,0,0,61065,0.57299999999999995,61068.83]
[2169,1,1,0,0,0,0,0,0,14886.48,0,0,14886.48,0.125,14984.06,467630.32,0,0,467630.32,3.9020000000000001,467742.53,77133.06,0,0,77133.06,0.64400000000000002,77197.899999999994]
[2170,1,1,0,0,0,0,0,0,13695,0,0,13695,0.14499999999999999,13770.2,655221.31999999995,0,0,655221.31999999995,7.9630000000000001,756221.58,122168,0,0,122168,1.2869999999999999,122222.43]
[2171,1,1,0,0,0,0,0,0,14238,0,0,14238,0.14499999999999999,14277.16,242708,0,0,242708,2.4649999999999999,242711.76,32044,0,0,32044,0.32500000000000001,32000.54]
[2172,1,1,0,0,0,0,0,0,14020.87,0.13,0,14021,0.14699999999999999,14015.33,646836.69999999995,0.3,0,646837,6.7839999999999998,646802.91,114009.15,-0.15,0,114009,1.196,114029.52]
[2174,1,1,0,0,0,0,0,0,20050.64,0,0,20050.64,0.14199999999999999,20068.21,314805.08,0,0,314805.08,2.2280000000000002,314873.08,108335.03,0,0,108335.03,0.76700000000000002,108396.61]
[2176,1,1,0,0,0,0,0,0,16352.75,0,0,16352.75,0.153,16423.419999999998,263652.7,0,0,263652.7,2.4569999999999999,263740.84000000003,65414.25,0,0,65414.25,0.61,65479]
[2180,1,1,0,0,0,0,0,0,19867.82,0,0,19867.82,0.14699999999999999,19894.39,635934.25,0,0,635934.25,4.6989999999999998,635943.91,60527.15,0,0,60527.15,0.44800000000000001,60630.53]
[2183,1,0,0,0,0,0,0,0,0,0,0,0,0,0,0,0,0,0,0,0,0,0,0,0,0,0]
[2184,1,1,0,0,0,0,0,0,23144,0,0,23144,0.151,23221.14,626961,0,0,626961,4.077,626970.72,102380,0,0,102380,0.66600000000000004,102419.06]
[2190,1,1,0,0,0,0,0,0,21760.959999999999,0,0,21760.959999999999,0.13300000000000001,21838.21,292917.15999999997,0,0,292917.15999999997,1.784,292927.56,168715.6,0,0,168715.6,1.0269999999999999,168630.38]
[2198,1,1,0,0,0,0,0,0,11626.74,0,0,11626.74,0.156,11608.4,152565,0,0,152565,2.0499999999999998,152546.28,81125.53,0,0,81125.53,1.0900000000000001,81109.97]
[2215,1,1,0,0,0,0,0,0,5176.6499999999996,0,0,5176.6499999999996,0.16700000000000001,5200.3,142388.14000000001,0,0,142388.14000000001,4.5739999999999998,142432.21,30698.73,0,0,30698.73,0.98599999999999999,30703.58]
[2310,1,1,0,0,0,0,0,0,16764.34,0,0,16764.34,0.14099999999999999,16789.27,666100.62,0,0,666100.62,5.5940000000000003,666093.41,103324.47,0,0,103324.47,0.86799999999999999,103355.22]
[2311,1,1,0,0,0,0,0,0,12422,0,0,12422,0.14699999999999999,12426.17,170469,0,0,170469,2.0129999999999999,170468.07,55349,0,0,55349,0.65300000000000002,55346.01]
[2342,1,1,0,0,0,0,0,0,21311.97,0,0,21311.97,0.182,21428.81,426651.77,0,0,426651.77,3.6240000000000001,426692.37,83125.05,0,0,83125.05,0.70699999999999996,83242.69]
[2358,1,1,0,0,0,0,0,0,3808,0,0,3808,0.14499999999999999,3811.21,88692,0,0,88692,3.3740000000000001,88683.03,24566,0,0,24566,0.93500000000000005,24575.759999999998]
[2359,1,0,0,0,0,0,0,0,0,0,0,0,0,0,0,0,0,0,0,0,0,0,0,0,0,0]
[2364,1,1,0,0,0,0,0,0,10356,0,0,10356,0.14799999999999999,10356,157586,0,0,157586,2.25,157586,61008,0,0,61008,0.871,61008]
[2365,1,1,0,0,0,0,0,0,24140.82,0,0,24140.82,0.14499999999999999,24067.02,655551.52,0,0,655551.52,3.95,655618.94999999995,117981.51,0,0,117981.51,0.71099999999999997,118011.41]
[2396,1,1,0,0,0,0,0,0,19399.04,0,0,19399.04,0.14499999999999999,19435.43,745178.55,0,0,745178.55,5.56,745248.28,139559.35,0,0,139559.35,1.042,139667.03]
[2397,1,1,0,0,0,0,0,0,13679.75,0,-3.11,13676.64,0.14099999999999999,13725.3,569090.96,0,-128.97999999999999,568961.98,5.8449999999999998,568967.31999999995,96518.5,0,-21.87,96496.63,0.99099999999999999,96466.49]
[2448,1,1,0,0,0,0,0,0,20764.07,0,0,20764.07,0.154,20726.14,356090.9,0,0,356090.9,2.6459999999999999,356112.7,73826.44,0,0,73826.44,0.54900000000000004,73887.33]
[2527,1,1,0,0,0,0,0,0,7168.1,0,0,7168.1,0.16,7176.4,184254.62,0,0,184254.62,4.109,184298.92,27492.69,0,0,27492.69,0.61299999999999999,27494.58]
[2534,1,1,0,0,0,0,0,0,17200.32,0,0,17200.32,0.14299999999999999,17251.82,578567.54,0,0,578567.54,4.7969999999999997,578720.25,91317.55,0,0,91317.55,0.75700000000000001,91326.080000000002]
[2536,1,1,0,0,0,0,0,0,11685.57,0,0,11685.57,0.155,11707.02,190724.83,0,0,190724.83,2.5249999999999999,190711.1,28565.72,0,0,28565.72,0.378,28550.02]
[2580,1,1,0,0,0,0,0,0,7150.39,0,0,7150.39,0.13900000000000001,7168.98,528714.68999999994,0,0,528714.68999999994,10.250999999999999,528699.02,65076.81,0,0,65076.81,1.262,65088.1]
[2609,1,1,0,0,0,0,0,0,7159.32,0,0,7159.32,0.15,7156.94,230119.32,0,0,230119.32,4.8230000000000004,230119.51,35879.660000000003,0,0,35879.660000000003,0.752,35880]
[2683,1,1,0,0,0,0,0,0,4284,0,0,4284,0.154,4292.49,149109,0,0,149109,5.35,149122.21,24876,0,0,24876,0.89200000000000002,24862.99]
[2687,1,1,0,0,0,0,0,0,12007,0,-2,12005,0.13600000000000001,11985.98,496400,0,-101,496299,5.6310000000000002,496272.42,132081,0,-27,132054,1.498,132022.04]
[2689,1,1,0,0,0,0,0,0,25664.01,0,0,25664.01,0.14099999999999999,25721.33,594565.96,0,0,594565.96,3.26,594691.68000000005,114280.62,0,0,114280.62,0.627,114377.82]
[2711,1,1,0,0,0,0,0,0,9488.85,0,0,9488.85,0.154,9474.92,18586.29,0,0,18586.29,0.30199999999999999,18580.68,0,0,0,0,0,0]
[2752,1,1,0,0,0,0,0,0,22401.69,0,0,22401.69,0.154,22385.47,1175029.82,0,0,1175029.82,8.0839999999999996,1175091.94,156004.10999999999,0,0,156004.10999999999,1.073,155971.51]
[2753,1,1,0,0,0,0,0,0,9030,0,0,9030,0.14000000000000001,9037.6200000000008,469208,0,0,469208,7.2690000000000001,469246.22,103661,0,0,103661,1.6060000000000001,103674.43]
[2754,1,1,0,0,0,0,0,0,12770,0,0,12770,0.154,12803.91,351711,0,0,351711,4.2309999999999999,351775.03,49171,0,0,49171,0.59199999999999997,49220.24]
[2758,1,0,0,0,0,0,0,0,0,0,0,0,0,0,0,0,0,0,0,0,0,0,0,0,0,0]
[2759,1,1,0,0,0,0,0,0,2394.35,0,0,2394.35,0.14099999999999999,2396.42,12057.61,0,0,12057.61,0.71,12067.07,23379.59,0,0,23379.59,1.3759999999999999,23386.32]
[2769,1,1,0,0,0,0,0,0,16221.27,0,0,16221.27,0.14899999999999999,16306.94,357034.79,0,0,357034.79,3.2629999999999999,357111.03999999998,117489.3,0,0,117489.3,1.0740000000000001,117541.3]
[2805,1,1,0,0,0,0,0,0,11542,0,0,11542,0.13700000000000001,11574.52,825872,0,0,825872,9.7750000000000004,825846.06,186079,0,0,186079,2.202,186037.14]
[2835,1,1,0,0,0,0,0,0,12691,0,0,12691,0.13900000000000001,12733.84,421077,0,0,421077,4.5960000000000001,421041.21,56618,0,0,56618,0.61799999999999999,56615.199999999997]
[2853,1,1,0,0,0,0,0,0,24719,0,0,24719,0.14199999999999999,24749.7,790249,0,0,790249,4.5339999999999998,790247.45,111375,0,0,111375,0.63900000000000001,111373.65]
[2854,1,1,0,0,0,0,0,0,11497.9,0,0,11497.9,0.16200000000000001,11520.68,399309.28,0,0,399309.28,5.6150000000000002,399312.58,46139.21,0,0,46139.21,0.64900000000000002,46153.85]
[2856,1,1,0,0,0,0,0,0,14725.4,0,0,14725.4,0.156,14804.5,210866.28,0,0,210866.28,2.222,210869.29,64878.46,0,0,64878.46,0.68400000000000005,64912.06]
[2859,1,1,0,0,0,0,0,0,18818.77,0.23,0,18819,0.13500000000000001,18827,842779.1,-0.1,-18,842761,6.0430000000000001,842752.37,158276.65,0.35,-3,158274,1.135,158286.26999999999]
[2860,1,1,0,0,0,0,0,0,25006.09,0,0,25006.09,0.14599999999999999,25038.59,1157559.8,0,0,1157559.8,6.75,1157605.8999999999,137219.51,0,0,137219.51,0.8,137197.74]
[2862,1,0,0,0,0,0,0,0,0,0,0,0,0,0,0,0,0,0,0,0,0,0,0,0,0,0]
[2884,1,1,0,0,0,0,0,0,18620.689999999999,0.31,0,18621,0.14399999999999999,18627.34,233028.18,-0.18,0,233028,1.802,233100.5,39555.629999999997,0.37,0,39556,0.30599999999999999,39583.1]
[2886,1,1,0,0,0,0,0,0,7587.94,0,0,7587.94,0.13,7604.56,197138.32,0,0,197138.32,3.37,197133.71,14021.77,0,0,14021.77,0.24,14039.2]
[2887,1,0,0,0,0,0,0,0,0,0,0,0,0,0,0,0,0,0,0,0,0,0,0,0,0,0]
[2888,1,1,206730.28,0,0,206730.28,1.9119999999999999,206777.48,19944.55,0,0,19944.55,0.185,20007.240000000002,218000.19,0,0,218000.19,2.0169999999999999,218132.94,34952.54,0,0,34952.54,0.32400000000000001,35039.699999999997]
[2889,1,1,0,0,0,0,0,0,17217,0,0,17217,0.14599999999999999,17216.560000000001,279822.92,0,0,279822.92,2.375,279822.78999999998,71327.649999999994,0,0,71327.649999999994,0.60499999999999998,71327.95]
[2890,1,1,0,0,0,0,0,0,19184.79,0,0,19184.79,0.151,19189.36,574752.99,0,0,574752.99,4.524,574918.19999999995,57410.36,0,0,57410.36,0.45200000000000001,57440.99]
[2895,1,1,0,0,0,0,0,0,30380.02,-0.02,0,30380,0.14699999999999999,30455.71,793272.82,0.18,0,793273,3.8290000000000002,793298.61,116680.52,-0.52,0,116680,0.56299999999999994,116643.28]
[2897,1,1,0,0,0,0,0,0,18802,0,0,18802,0.154,18828.21,592666,0,0,592666,4.8490000000000002,592844.12,115901,0,0,115901,0.94799999999999995,115903.53]
[2898,1,1,0,0,0,0,0,0,13068.73,0.27,0,13069,0.13900000000000001,13136.82,292042.21999999997,-0.22,0,292042,3.0910000000000002,292128.86,37156.06,-0.06,0,37156,0.39400000000000002,37236.74]
[2899,1,1,0,0,0,0,0,0,15126,0,0,15126,0.14499999999999999,15094.39,695912,0,0,695912,6.6849999999999996,695903.49,102242,0,0,102242,0.98199999999999998,102225.46]
[2902,1,1,0,0,0,0,0,0,12529,0,0,12529,0.14399999999999999,12553.99,456842,0,0,456842,5.2409999999999997,456913.05,40462,0,0,40462,0.46500000000000002,40538.94]
[2903,1,1,0,0,0,0,0,0,8956.42,0,0,8956.42,0.14099999999999999,8970.81,221942.06,0,0,221942.06,3.49,222043.5,48064.85,0,0,48064.85,0.75600000000000001,48098.82]
[2904,1,1,100000,0,0,100000,0.74299999999999999,100062.46,18031,0,0,18031,0.13400000000000001,18046.259999999998,575237,0,0,575237,4.2720000000000002,575325.49,75774,0,0,75774,0.56299999999999994,75821.22]
[2905,1,1,0,0,0,0,0,0,18195.14,0,0,18195.14,0.13300000000000001,18160.2,935152.16,0,0,935152.16,6.8490000000000002,935181.98,145761.16,0,0,145761.16,1.0680000000000001,145827.76]
[2906,1,1,0,0,0,0,0,0,8226,0,0,8226,0.13600000000000001,8234.6299999999992,508375,0,0,508375,8.3970000000000002,508427.85,56916,0,0,56916,0.94099999999999995,56976.37]
[2907,1,1,0,0,0,0,0,0,8314.6299999999992,0,0,8314.6299999999992,0.125,8352.7999999999993,160182.25,0,0,160182.25,2.3980000000000001,160240.12,33578.74,0,0,33578.74,0.503,33611.67]
[2908,1,1,0,0,0,0,0,0,8493.33,0,0,8493.33,0.15,8532.07,338179.24,0,0,338179.24,5.9470000000000001,338268.21,38854.800000000003,0,0,38854.800000000003,0.68400000000000005,38906.25]
[3999,1,0,0,0,0,0,0,0,0,0,0,0,0,0,0,0,0,0,0,0,0,0,0,0,0,0]

{"sheet":"Page 2 Bottom","index":18,"n_rows":535,"n_cols":23,"rows_kept":535,"cut":false,"hidden":true,"merged":[]}
[1,2,3,4,5,6,7,8,9,10,11,12,13,14,15,16,17,18,19,20,21,22,23]
[null,null,null,"21-7","22-7","23-7","24-7","25-7","26-7","21-8","22-8","23-8","24-8","25-8","26-8","21-NTC sub","22-NTC sub","23-NTC sub","24-NTC sub","25-NTC sub","26-NTC sub"]
["dst_num","dst_tye","dst_act_sts","gds_crt_tax_lvy","gds_cua_tax_adj","gds_fid_tax_adj","gds_adj_tax_lvy","gds_tax_mil_rat","gds_spd_tax_lvy","gds_crt_tax_lvy_2","gds_cua_tax_adj_2","gds_fid_tax_adj_2","gds_adj_tax_lvy_2","gds_tax_rat_2","gds_spd_tax_lvy_2","tot_aud_crt_lvy","tot_aud_cou_adj","tot_aud_fiy_dip","tot_aud_adj_lvy","tot_aud_tax_rat","tot_aud_spr_lvy","dip_aid_aud","tot_spr_lvy"]
[1,1,1,0,0,0,0,0,0,124968.79,0,-4854.5200000000004,120114.27,0.74199999999999999,120130.73,678797.39,0,-26368.42,652428.97,4.03,652462.05000000005,28,1147936.8799999999]
[1.2,3,1,0,0,0,0,0,0,63425842.920000002,0,-7065350.6699999999,56360492.25,12.782999999999999,56364272.240000002,102105299.12,0,-11374060.85,90731238.269999996,20.58,90743700.439999998,430047,169231009.66999999]
[2,1,1,205425.8,0,0,205425.8,14.755000000000001,205424.13,0,0,0,0,0,0,292237.44,0,0,292237.44,20.991,292243.84000000003,6156,389260.58]
[4,1,1,691037.39,0,0,691037.39,8.16,691044.29,120133.73,0,0,120133.73,1.419,120170.57,1315618.93,0,0,1315618.93,15.537000000000001,1315778.82,5722,1431546.11]
[6,3,1,2348997,0,-575440,1773557,14.401999999999999,1773539.19,178125,0,-43636,134489,1.0920000000000001,134474.71,5849927,0,-1433074,4416853,35.868000000000002,4416977.0599999996,0,6471061.0199999996]
[11,1,1,7494315.29,0,-1395790,6098525.29,3.274,6098847.7300000004,0,0,0,0,0,0,42420922.259999998,0,-7796491,34624431.259999998,18.59,34629682.140000001,0,75873726.730000004]
[12,1,1,4678003.76,0,-920703,3757300.76,13.246,3757388.18,395281.11,0,-66427,328854.11,1.1599999999999999,329048.03999999998,10003448.390000001,0,-1750849,8252599.3899999997,29.097000000000001,8253716.1399999997,0,13293254.289999999]
[13,1,1,2073368.45,0,-561851,1511517.45,9.6329999999999991,1511611.03,85254.77,0,-24581,60673.77,0.38700000000000001,60728.07,6034162.75,0,-1698682,4335480.75,27.632999999999999,4336172.29,161,6715378.54]
[14,1,1,2074591.33,0,-506428,1568163.33,13.71,1568251.67,1229215.02,0,-357557,871658.02,7.6210000000000004,871746.6,7218859.79,0,-1567656,5651203.79,49.408000000000001,5651654.1399999997,0,7670124.6399999997]
[15,1,1,5005250.4000000004,0,-874880,4130370.4,16.507000000000001,4130382.53,1041436.19,0,-179000,862436.19,3.4470000000000001,862508.55,8600650.3699999992,0,-1371263,7229387.3700000001,28.893000000000001,7229608.2000000002,0,9857951.4199999999]
[16,1,1,10165243.439999999,0,-1191011,8974232.4399999995,25.760999999999999,8974473.9499999993,483352.82,0,-69193,414159.82,1.1890000000000001,414217.21,16081531.609999999,0,-2068432,14013099.609999999,40.228999999999999,14014755.34,0,19391281.010000002]
[21,1,0,0,0,0,0,0,0,0,0,0,0,0,0,0,0,0,0,0,0,0,0]
[22,1,1,0,0,0,0,0,0,0,0,0,0,0,0,2145955.5,0,0,2145955.5,9.1120000000000001,2145955.9900000002,728,4526064.33]
[23,1,1,54297.77,0,0,54297.77,0.70899999999999996,54298.26,842766.31,0,0,842766.31,10.999000000000001,842766.2,1441636.63,0,0,1441636.63,18.815999999999999,1441636.93,0,2087177.16]
[24,1,0,0,0,0,0,0,0,0,0,0,0,0,0,0,0,0,0,0,0,0,0]
[25,1,1,0,0,0,0,0,0,0,0,0,0,0,0,0,0,0,0,0,0,0,0]
[31,1,1,3229810.6,0,0,3229810.6,9.7609999999999992,3236240.91,0,0,0,0,0,0,6798991.8899999997,0,0,6798991.8899999997,20.545999999999999,6811987.0599999996,0,10858951.27]
[32,1,1,125278.53,0,0,125278.53,4.0880000000000001,125283.67,151777.59,0,0,151777.59,4.9530000000000003,151793.06,567258.04,0,0,567258.04,18.510000000000002,567270.24,6620,822606.3]
[36,1,1,339575.59,0,0,339575.59,30.332999999999998,339581.27,0,0,0,0,0,0,386037.8,0,0,386037.8,34.482999999999997,386040.98,0,427788.42]
[38,1,1,4166.53,0,0,4166.53,25.966999999999999,4166.92,0,0,0,0,0,0,4917.25,0,0,4917.25,30.64,4916.8,0,7513.88]
[47,1,1,4582311.12,0,0,4582311.12,26.018000000000001,4582258.68,0,0,0,0,0,0,6113619.3499999996,0,0,6113619.3499999996,34.712000000000003,6113435.4400000004,2001,8512264.3000000007]
[51,1,1,3684955.87,0,0,3684955.87,51.695,3684932.3,0,0,0,0,0,0,4044044.35,0,0,4044044.35,56.732999999999997,4044051.93,365,4596751.28]
[55,1,0,0,0,0,0,0,0,0,0,0,0,0,0,0,0,0,0,0,0,0,0]
[57,1,0,0,0,0,0,0,0,0,0,0,0,0,0,0,0,0,0,0,0,0,0]
[58,1,0,0,0,0,0,0,0,0,0,0,0,0,0,0,0,0,0,0,0,0,0]
[60,1,0,0,0,0,0,0,0,0,0,0,0,0,0,0,0,0,0,0,0,0,0]
[62,1,0,0,0,0,0,0,0,0,0,0,0,0,0,0,0,0,0,0,0,0,0]
[70,1,0,0,0,0,0,0,0,0,0,0,0,0,0,0,0,0,0,0,0,0,0]
[72,1,0,0,0,0,0,0,0,0,0,0,0,0,0,0,0,0,0,0,0,0,0]
[75,1,1,755225.11,0,0,755225.11,17.568999999999999,755224.02,0,0,0,0,0,0,984223.25,0,0,984223.25,22.896999999999998,984224.24,42,1451926.85]
[77,1,1,8170480.8899999997,0,0,8170480.8899999997,12.544,8166663.2000000002,0,0,0,0,0,0,14653508.75,0,0,14653508.75,22.498000000000001,14646817.119999999,53784,22806351.539999999]
[78,1,0,0,0,0,0,0,0,0,0,0,0,0,0,0,0,0,0,0,0,0,0]
[79,1,0,0,0,0,0,0,0,0,0,0,0,0,0,0,0,0,0,0,0,0,0]
[81,1,1,0,0,0,0,0,0,0,0,0,0,0,0,153709.99,0,0,153709.99,3.45,153684.59,4829,307871.90000000002]
[84,1,1,0,0,0,0,0,0,338667.29,0,0,338667.29,3.653,338701.52,868101.01,0,0,868101.01,9.3640000000000008,868218.19,3873,1250548.5900000001]
[85,1,1,0,0,0,0,0,0,0,0,0,0,0,0,402164.58,0,0,402164.58,6.1550000000000002,402115.26,6147,612939.19999999995]
[88,1,1,2137161.4900000002,0,0,2137161.4900000002,9.7759999999999998,2137217,518434.4,0,0,518434.4,2.371,518345.08,4442822.9800000004,0,0,4442822.9800000004,20.321999999999999,4442770.4400000004,27378,7891394.3399999999]
[91,1,1,278756,0,0,278756,8.9350000000000005,278764.58,164504.51,0,0,164504.51,5.2729999999999997,164513.22,634141.48,0,0,634141.48,20.326000000000001,634154.31999999995,5945,986721.13]
[93,1,1,0,0,0,0,0,0,62623.18,0,0,62623.18,1.339,62622.19,457876.32,0,0,457876.32,9.7910000000000004,457904.31,28283,1180726.33]
[94,1,1,2869645.95,0,0,2869645.95,27.766999999999999,2869659.75,428191.49,0,0,428191.49,4.1429999999999998,428170.14,4881082.92,0,0,4881082.92,47.228999999999999,4881015.6100000003,185621,6125357.3600000003]
[95,1,1,478705.06,0,0,478705.06,23.643000000000001,478705.73,0,0,0,0,0,0,659078.98,0,0,659078.98,32.551000000000002,659068.23,2425,832181.45]
[97,1,1,925022.6,0,0,925022.6,21.7,925008.94,0,0,0,0,0,0,1224371.42,0,0,1224371.42,28.722000000000001,1224336.72,28013,1457147.38]
[99,1,1,110704.41,0,0,110704.41,2.1030000000000002,110717.19,46873.38,0,0,46873.38,0.89,46856.06,1630372.29,0,0,1630372.29,30.968,1630380.35,20408,2383848.06]
[100,1,1,342368.2,0,0,342368.2,10.324999999999999,342361.51,0,0,0,0,0,0,553424.96,0,0,553424.96,16.690000000000001,553415.36,2310,874756.91]
[108,1,1,987341,0,-119293,868048,10.016,868048,43105,0,-5208,37897,0.437,37897,1855851,0,-224229,1631622,18.827000000000002,1631622,972,2293016.98]
[110,1,1,6547230,0,-613637,5933593,24.933,5933593,311996,0,-29242,282754,1.1879999999999999,282754,8201976,0,-768727,7433249,31.234999999999999,7433249,431,10226993.880000001]
[111,1,1,4170271,0,-490788,3679483,34.648000000000003,3679483,381963,0,-44952,337011,3.173,337011,5238621,0,-616520,4622101,43.524000000000001,4622101,917,5700567.9299999997]
[112,1,1,16759369,0,-1347326,15412043,21.882999999999999,15412042,893414,0,-71824,821590,1.167,821589.99,28341230,0,-2278421,26062809,37.006999999999998,26062808.989999998,523,42300682.450000003]
[113,1,1,970738.93,0,0,970738.93,4.93,970639.55,257261.27,0,0,257261.27,1.3069999999999999,257327.77,1872986.92,0,0,1872986.92,9.5129999999999999,1872960.25,2441,2555137.86]
[114,1,0,0,0,0,0,0,0,0,0,0,0,0,0,0,0,0,0,0,0,0,0]
[115,1,1,1942127.5,0,0,1942127.5,22.731000000000002,1942158.92,152615.16,0,0,152615.16,1.786,152597.59,2372618.17,0,0,2372618.17,27.768999999999998,2372610.58,4661,3092204.61]
[116,1,1,1064026.7,0,0,1064026.7,10.657,1064013.6399999999,0,0,0,0,0,0,1764843.54,0,0,1764843.54,17.675999999999998,1764802.95,370,2549305.04]
[117,1,0,0,0,0,0,0,0,0,0,0,0,0,0,0,0,0,0,0,0,0,0]
[118,1,1,1721273.8,0,0,1721273.8,11.297000000000001,1721272.38,0,0,0,0,0,0,1912094.31,0,0,1912094.31,12.548999999999999,1912033.92,131,2277900.2400000002]
[119,1,0,0,0,0,0,0,0,0,0,0,0,0,0,0,0,0,0,0,0,0,0]
[126,1,0,0,0,0,0,0,0,0,0,0,0,0,0,0,0,0,0,0,0,0,0]
[127,1,0,0,0,0,0,0,0,0,0,0,0,0,0,0,0,0,0,0,0,0,0]
[128,1,0,0,0,0,0,0,0,0,0,0,0,0,0,0,0,0,0,0,0,0,0]
[129,1,1,0,0,0,0,0,0,1024377.82,0,0,1024377.82,12.304,1024397.94,1808652.8,0,0,1808652.8,21.725000000000001,1808765.06,58048,2456702.37]
[138,1,1,3655624.42,0,0,3655624.42,22.201000000000001,3655624,0,0,0,0,0,0,5593648,0,0,5593648,33.972000000000001,5593648,3972,7437947.0700000003]
[139,1,1,1182915.22,0,0,1182915.22,25.216999999999999,1182915,28592.23,0,0,28592.23,0.61,28592,1526438.07,0,0,1526438.07,32.54,1526438,654,2033297.01]
[140,1,0,0,0,0,0,0,0,0,0,0,0,0,0,0,0,0,0,0,0,0,0]
[141,1,0,0,0,0,0,0,0,0,0,0,0,0,0,0,0,0,0,0,0,0,0]
[145,1,0,0,0,0,0,0,0,0,0,0,0,0,0,0,0,0,0,0,0,0,0]
[146,1,1,0,0,0,0,0,0,0,0,0,0,0,0,476812.47,0,0,476812.47,5.7850000000000001,476812,1452,1111877.95]
[147,1,0,0,0,0,0,0,0,0,0,0,0,0,0,0,0,0,0,0,0,0,0]
[150,1,1,838670.23,0,0,838670.23,16.847999999999999,838670,0,0,0,0,0,0,1155037.56,0,0,1155037.56,23.202999999999999,1155037,0,1472135.96]
[152,1,1,6912994.6500000004,0,0,6912994.6500000004,17.681000000000001,6912995,0,0,0,0,0,0,11901273.58,0,0,11901273.58,30.44,11901274,5056,17656613.640000001]
[158,1,0,0,0,0,0,0,0,0,0,0,0,0,0,0,0,0,0,0,0,0,0]
[161,1,0,0,0,0,0,0,0,0,0,0,0,0,0,0,0,0,0,0,0,0,0]
[162,1,1,0,0,0,0,0,0,263098,0,0,263098,5.5880000000000001,263098.18,1118330,0,0,1118330,23.751999999999999,1118332.06,38622,1497745.6]
[166,1,1,249677.6,0,-1661.59,248016.01,1.546,248056.81,532061.27,0,-3540.81,528520.46,3.294,528524.67000000004,909277.21,0,-6051.15,903226.06,5.6289999999999996,903177.1,2481,1734284.65]
[173,1,1,0,0,0,0,0,0,0,0,0,0,0,0,369425,0,0,369425,5.2530000000000001,369523.07,19032,861077.42]
[175,1,0,0,0,0,0,0,0,0,0,0,0,0,0,0,0,0,0,0,0,0,0]
[177,1,1,1026985.19,-0.19,0,1026985,10.163,1027007.43,0,0,0,0,0,0,1710493.16,-0.16,0,1710493,16.928000000000001,1710634.83,35689,2714768.33]
[178,1,0,0,0,0,0,0,0,0,0,0,0,0,0,0,0,0,0,0,0,0,0]
[181,1,1,6287623.6500000004,0,0,6287623.6500000004,11.21,6287815.2199999997,175860.53,0,0,175860.53,0.314,176126.14,13874596.48,0,0,13874596.48,24.739000000000001,13876383.67,13430,18954735.390000001]
[182,1,1,1614226.51,0,-53247.26,1560979.25,8.2050000000000001,1561021.76,0,0,0,0,0,0,2967899.44,0,-97899.839999999997,2869999.6,15.087,2870339.47,6865,3739941.11]
[186,1,1,3012124.16,0,0,3012124.16,9.4879999999999995,3012247.68,0,0,0,0,0,0,4112376.88,0,0,4112376.88,12.954000000000001,4112632.42,0,5439190.6500000004]
[191,1,1,3446830,0,-432613,3014217,4.6289999999999996,3013952.45,5658050,0,-710145,4947905,7.6,4948377.33,20495692,0,-2572431,17923261,27.529,17924194.66,0,33375778.91]
[192,1,1,14154747,0,-2050260,12104487,41.835000000000001,12104439.33,89839,0,-13013,76826,0.26600000000000001,76963.81,18361354,0,-2659570,15701784,54.268999999999998,15702063.300000001,0,20868535.620000001]
[194,1,1,15296412,0,-1531560,13764852,20.372,13765312.93,737829,0,-73876,663953,0.98299999999999998,664210.81000000006,24713195,0,-2474423,22238772,32.914000000000001,22239913.109999999,0,38885727.200000003]
[195,1,1,555874,0,-20741,535133,10.75,535126.82999999996,7419,0,-277,7142,0.14399999999999999,7168.21,882408,0,-32926,849482,17.065000000000001,849482.73,0,1272289.71]
[196,1,1,6559095,0,-750685,5808410,3.7309999999999999,5809156.3300000001,223107,0,-25534,197573,0.127,197738.64,41027401,0,-4695564,36331837,23.335999999999999,36334085.270000003,0,79027934.120000005]
[197,1,1,3632329,0,-312527,3319802,5.7569999999999997,3320029.49,388862,0,-33458,355404,0.61599999999999999,355243.73,14066817,0,-1210314,12856503,22.295000000000002,12857400.98,0,22195833.530000001]
[199,1,1,3917753,0,-487633,3430120,13.252000000000001,3430020.2,435138,0,-54160,380978,1.472,380998.32,8446607,0,-1051326,7395281,28.571999999999999,7395301.6200000001,0,11244024.199999999]
[200,1,1,4278012,0,-569149,3708863,11.71,3709009.24,268034,0,-35659,232375,0.73399999999999999,232486.15,7418107,0,-986909,6431198,20.305,6431377.6900000004,0,13415195.560000001]
[201,1,0,0,0,0,0,0,0,0,0,0,0,0,0,0,0,0,0,0,0,0,0]
[202,1,0,0,0,0,0,0,0,0,0,0,0,0,0,0,0,0,0,0,0,0,0]
[203,1,1,565789,0,0,565789,6.3029999999999999,565809.66,0,0,0,0,0,0,1213994,0,0,1213994,13.523,1213936.8500000001,20571,1801412.82]
[204,1,1,3125489,0,0,3125489,35.406999999999996,3125528.49,53974,0,0,53974,0.61099999999999999,53935.6,3850152,0,0,3850152,43.616,3850172.29,67089,4713007.5199999996]
[205,1,0,0,0,0,0,0,0,0,0,0,0,0,0,0,0,0,0,0,0,0,0]
[206,1,1,4013788.81,0,0,4013788.81,9.1530000000000005,4014247.41,648170.07999999996,0,0,648170.07999999996,1.478,648209.07999999996,7726689.0999999996,0,0,7726689.0999999996,17.620999999999999,7728073.1699999999,376,11387668.609999999]
[207,1,0,0,0,0,0,0,0,0,0,0,0,0,0,0,0,0,0,0,0,0,0]
[208,1,0,0,0,0,0,0,0,0,0,0,0,0,0,0,0,0,0,0,0,0,0]
[209,1,0,0,0,0,0,0,0,0,0,0,0,0,0,0,0,0,0,0,0,0,0]
[213,1,1,1075756.05,0,0,1075756.05,23.26,1075826.6399999999,0,0,0,0,0,0,1439264.02,0,0,1439264.02,31.120999999999999,1439415.34,5643,1636373.99]
[217,1,0,0,0,0,0,0,0,0,0,0,0,0,0,0,0,0,0,0,0,0,0]
[218,1,0,0,0,0,0,0,0,0,0,0,0,0,0,0,0,0,0,0,0,0,0]
[219,1,0,0,0,0,0,0,0,0,0,0,0,0,0,0,0,0,0,0,0,0,0]
[222,1,0,0,0,0,0,0,0,0,0,0,0,0,0,0,0,0,0,0,0,0,0]
[223,1,0,0,0,0,0,0,0,0,0,0,0,0,0,0,0,0,0,0,0,0,0]
[224,1,0,0,0,0,0,0,0,0,0,0,0,0,0,0,0,0,0,0,0,0,0]
[225,1,0,0,0,0,0,0,0,0,0,0,0,0,0,0,0,0,0,0,0,0,0]
[227,1,1,1504842,0,0,1504842,22.079000000000001,1488866.9,74709,0,0,74709,1.0960000000000001,73907.25,2035436,0,0,2035436,29.863,2013770.2,10434,2779694.78]
[228,1,0,0,0,0,0,0,0,0,0,0,0,0,0,0,0,0,0,0,0,0,0]
[229,1,1,130451.75,0,0,130451.75,4.4059999999999997,130451.57,0,0,0,0,0,0,302193.21999999997,0,0,302193.21999999997,10.207000000000001,302205.90000000002,27571,372441.06]
[232,1,0,0,0,0,0,0,0,0,0,0,0,0,0,0,0,0,0,0,0,0,0]
[233,1,0,0,0,0,0,0,0,0,0,0,0,0,0,0,0,0,0,0,0,0,0]
[234,1,0,0,0,0,0,0,0,0,0,0,0,0,0,0,0,0,0,0,0,0,0]
[236,1,0,0,0,0,0,0,0,0,0,0,0,0,0,0,0,0,0,0,0,0,0]
[237,1,0,0,0,0,0,0,0,0,0,0,0,0,0,0,0,0,0,0,0,0,0]
[238,1,1,0,0,0,0,0,0,0,0,0,0,0,0,148478.19,0,0,148478.19,4.2279999999999998,148481.01999999999,20722,522510.98]
[239,1,1,1282649.3999999999,0,0,1282649.3999999999,24.786999999999999,1282667.76,0,0,0,0,0,0,1565276.12,0,0,1565276.12,30.248000000000001,1565261.4,42150,2073034.16]
[240,1,0,0,0,0,0,0,0,0,0,0,0,0,0,0,0,0,0,0,0,0,0]
[241,1,1,2652226.0499999998,0,0,2652226.0499999998,13.625,2652250.6800000002,258519.26,0,0,258519.26,1.3280000000000001,258509.28,4960121.7300000004,0,0,4960121.7300000004,25.481999999999999,4960341.42,33028,7791282.7400000002]
[242,1,1,222137.85,0,0,222137.85,6.5549999999999997,222121.75,271251.8,0,0,271251.8,8.0050000000000008,271256.23,833411.64,0,0,833411.64,24.594000000000001,833388.6,9431,1152963.8899999999]
[243,1,0,0,0,0,0,0,0,0,0,0,0,0,0,0,0,0,0,0,0,0,0]
[244,1,0,0,0,0,0,0,0,0,0,0,0,0,0,0,0,0,0,0,0,0,0]
[245,1,0,0,0,0,0,0,0,0,0,0,0,0,0,0,0,0,0,0,0,0,0]
[252,1,1,1705196.92,0.08,-1729.37,1703467.63,16.491,1703473.3,484608.41,-0.41,-491.48,484116.52,4.6870000000000003,484153.74,2720429.01,-0.01,-2759,2717670,26.31,2717748.02,7496,4236621.33]
[253,1,1,460966.93,7.0000000000000007E-2,0,460967,9.8350000000000009,460950.32,0,0,0,0,0,0,777188.11,-0.11,0,777188,16.582000000000001,777171.15,1037,1111146.27]
[254,1,0,0,0,0,0,0,0,0,0,0,0,0,0,0,0,0,0,0,0,0,0]
[255,1,1,2322068.2799999998,-0.28000000000000003,0,2322068,30.399000000000001,2322057.71,59999.46,-0.46,0,59999,0.78500000000000003,59963,2938873.47,-0.47,0,2938873,38.473999999999997,2938874.58,9010,3756724.39]
[256,1,1,1608523.11,-0.11,0,1608523,4.3710000000000004,1608423.05,319899,0,0,319899,0.86899999999999999,319771.14,6067240.2800000003,-0.28000000000000003,0,6067240,16.488,6067188.1299999999,30418,9982926.2300000004]
[258,1,0,0,0,0,0,0,0,0,0,0,0,0,0,0,0,0,0,0,0,0,0]
[260,1,0,0,0,0,0,0,0,0,0,0,0,0,0,0,0,0,0,0,0,0,0]
[261,1,1,534261.39,0,0,534261.39,21.919,534305.22,0,0,0,0,0,0,658982.87,0,0,658982.87,27.038,659087.76,1189,993938.85]
[262,1,0,0,0,0,0,0,0,0,0,0,0,0,0,0,0,0,0,0,0,0,0]
[263,1,0,0,0,0,0,0,0,0,0,0,0,0,0,0,0,0,0,0,0,0,0]
[264,1,1,0,0,0,0,0,0,0,0,0,0,0,0,184433.67,0,0,184433.67,3.5960000000000001,184608.82,2733,413083.59]
[265,1,0,0,0,0,0,0,0,0,0,0,0,0,0,0,0,0,0,0,0,0,0]
[270,1,1,4766270.6399999997,0,-289051.56,4477219.08,4.1580000000000004,4478090.16,5744761.8099999996,0,-348390.71,5396371.0999999996,5.0110000000000001,5396755.5999999996,29359134.199999999,0,-1780489.42,27578644.780000001,25.611000000000001,27582579.859999999,0,46004966.630000003]
[271,1,1,6924470.4900000002,0,-482479.35999999999,6441991.1299999999,5.1239999999999997,6442803.1299999999,1971530.85,0,-137372.54999999999,1834158.3,1.4590000000000001,1834514.01,27873522.579999998,0,-1942150.21,25931372.370000001,20.626999999999999,25935928.989999998,0,47959955.060000002]
[272,1,1,2049180.05,0,-99465.87,1949714.18,2.0299999999999998,1950214.85,1917795.1,0,-93089.1,1824706,1.9,1825324.24,22073387.030000001,0,-1071433.32,21001953.710000001,21.864999999999998,21005639.25,0,41379436.090000004]
[273,1,1,13967037.189999999,0,-364445.63,13602591.560000001,14.022,13603489.85,1429675.99,0,-37304.53,1392371.46,1.4359999999999999,1393140.17,34660599.890000001,0,-904408.94,33756190.950000003,34.798000000000002,33759395.229999997,0,50638464.390000001]
[276,1,1,1280280.55,0,-41350.29,1238930.26,1.431,1239393.58,4752685.87,0,-153499.5,4599186.37,5.3109999999999999,4599873.72,20376293.079999998,0,-658100.47999999998,19718192.600000001,22.77,19721168.260000002,0,43087038.689999998]
[277,1,1,3285654.87,0,-119367.9,3166286.97,8.6630000000000003,3166416.68,0,0,0,0,0,0,7867264.04,0,-285817.99,7581446.0499999998,20.744,7582147.9500000002,0,12516181.130000001]
[278,1,1,5178096.5,0,-108153.69,5069942.8099999996,13.442,5069996.3,0,0,0,0,0,0,8994333.2100000009,0,-187862.3,8806470.9100000001,23.352,8807807.8800000008,0,16134976.119999999]
[279,1,1,12993146.08,0,-1515309.14,11477836.939999999,7.7560000000000002,11479308.75,2162893.62,0,-252240.1,1910653.52,1.2909999999999999,1910751.37,44778191.990000002,0,-5222206.75,39555985.240000002,26.73,39561877.640000001,0,79518851.010000005]
[280,1,1,0,0,0,0,0,0,4175571.84,0,-603497.91,3572073.93,8.923,3572451.01,12660077.93,0,-1829769.88,10830308.050000001,27.053999999999998,10831456.859999999,0,16203439.08]
[281,1,1,2353396.09,0,-404416.12,1948979.97,2.3199999999999998,1949203.84,15793665.689999999,0,-2714069.81,13079595.880000001,15.568,13079829.92,32067668.640000001,0,-5510689.9100000001,26556978.73,31.611999999999998,26559582.699999999,0,47767556.299999997]
[282,1,1,911821.68,0,-122373.38,789448.3,8.4290000000000003,789490.91,754961.03,0,-101321.19,653639.84,6.9790000000000001,653678.61,3615923.61,0,-485284.04,3130639.57,33.427999999999997,3130988.49,0,6063425.5599999996]
[283,1,1,6067277.0199999996,0,-511519.39,5555757.6299999999,9.7200000000000006,5556118.5,113413.44,0,-9561.25,103852.19,0.182,104034.32,13569106.380000001,0,-1143984.78,12425121.6,21.74,12426956.41,0,23957488.859999999]
[284,1,1,5090014.83,0,-230541.75,4859473.08,3.7090000000000001,4859678.68,3305212.33,0,-149701.60999999999,3155510.72,2.4089999999999998,3156367.2,36075687.740000002,0,-1633969.89,34441717.850000001,26.29,34446199.090000004,0,58117510.229999997]
[286,1,1,1535132.43,0,-521409.59,1013722.84,19.475999999999999,1013744.5,227798.6,0,-77372.44,150426.16,2.89,150427.26999999999,3187295.43,0,-1082570.27,2104725.16,40.438000000000002,2104836.73,0,2832272.37]
[287,6,0,0,0,0,0,0,0,0,0,0,0,0,0,0,0,0,0,0,0,0,0]
[288,6,0,0,0,0,0,0,0,0,0,0,0,0,0,0,0,0,0,0,0,0,0]
[294,1,1,0,0,0,0,0,0,124001,0,0,124001,3.867,124001.93,243114,0,0,243114,7.5819999999999999,243129.72,16022,1048916.44]
[297,1,1,0,0,0,0,0,0,29172,0,0,29172,1.212,29170.36,178207,0,0,178207,7.4050000000000002,178223.17,36145,577405.57999999996]
[299,1,1,1449315,0,0,1449315,25.353000000000002,1449312.61,0,0,0,0,0,0,2093189,0,0,2093189,36.616999999999997,2093222.89,42606,2566490.4500000002]
[300,1,1,688366,0,0,688366,9.5570000000000004,688393.77,0,0,0,0,0,0,1479489,0,0,1479489,20.54,1479502.78,35586,2405687.46]
[301,1,0,0,0,0,0,0,0,0,0,0,0,0,0,0,0,0,0,0,0,0,0]
[306,1,1,609398,0,0,609398,23.902000000000001,609394.16,0,0,0,0,0,0,773242,0,0,773242,30.327999999999999,773228.43,0,937034.71]
[308,1,1,265977,0,0,265977,4.4459999999999997,265974.65999999997,56841,0,0,56841,0.95,56832.19,571181,0,0,571181,9.5470000000000006,571133.62,0,1071151.7]
[309,1,1,2174733,0,0,2174733,10.346,2174636.29,577073,0,0,577073,2.7450000000000001,576974.35,3696362,0,0,3696362,17.585000000000001,3696209.09,0,5017901.13]
[314,1,1,749029,0,0,749029,18.303000000000001,749029,92943,0,0,92943,2.2709999999999999,92943,1309691,0,0,1309691,32.003,1309690.97,1184,1647029.93]
[316,1,1,36566.61,0,-3260.61,33306,0.52,33325.949999999997,566794.56999999995,0,-50540.58,516253.99,8.0549999999999997,516231.82,2331163.12,0,-207868.45,2123294.67,33.131,2123311.7799999998,46376,2610257.77]
[317,1,1,844309.05,0,0,844309.05,10.102,844355.97,290370.8,0,0,290370.8,3.4740000000000002,290367.52,1365655.12,0,0,1365655.12,16.338999999999999,1365663.46,4618,1964284.16]
[318,1,1,778294.3,0,-20227.13,758067.17,1.794,758045.3,0,0,0,0,0,0,7532941.2699999996,0,-195774.43,7337166.8399999999,17.364999999999998,7337489.75,38733,10750181.49]
[319,1,1,0,0,0,0,0,0,87623.86,0,-5269.73,82354.13,2.3740000000000001,82348.77,490169.36,0,-29478.95,460690.41,13.281000000000001,460688.28,35378,737247.12]
[323,2,1,0,0,0,0,0,0,0,0,0,0,0,0,3572,0,0,3572,1.1870000000000001,3572,0,87598]
[324,1,0,0,0,0,0,0,0,0,0,0,0,0,0,0,0,0,0,0,0,0,0]
[325,1,0,0,0,0,0,0,0,0,0,0,0,0,0,0,0,0,0,0,0,0,0]
[328,1,0,0,0,0,0,0,0,0,0,0,0,0,0,0,0,0,0,0,0,0,0]
[330,1,1,0,0,0,0,0,0,272139.32,-0.32,0,272139,4.2050000000000001,272163.96000000002,564941.39,-0.39,0,564941,8.7279999999999998,564910.11,9616,1121575.24]
[332,1,1,1305568.06,0,0,1305568.06,18.411000000000001,1305601.52,0,0,0,0,0,0,1984073.95,0,0,1984073.95,27.978999999999999,1984108.67,0,2784917.4]
[333,1,1,536223.11,0,0,536223.11,24.771000000000001,536230.22,55993,0,0,55993,2.5870000000000002,56002.080000000002,864624.08,0,0,864624.08,39.942,864644.44,2654,1040656.8]
[341,1,0,0,0,0,0,0,0,0,0,0,0,0,0,0,0,0,0,0,0,0,0]
[345,1,1,1368758.69,0,0,1368758.69,9.8780000000000001,1368924.36,161248.5,0,0,161248.5,1.1639999999999999,161310.79,2757460.56,0,0,2757460.56,19.901,2757943.28,9027,4093246.03]
[346,1,0,0,0,0,0,0,0,0,0,0,0,0,0,0,0,0,0,0,0,0,0]
[347,1,1,3633980.41,0,0,3633980.41,15.365,3634563.86,0,0,0,0,0,0,6473411.6200000001,0,0,6473411.6200000001,27.37,6474325.5899999999,951,8777463.5099999998]
[351,1,0,0,0,0,0,0,0,0,0,0,0,0,0,0,0,0,0,0,0,0,0]
[352,1,0,0,0,0,0,0,0,0,0,0,0,0,0,0,0,0,0,0,0,0,0]
[353,1,0,0,0,0,0,0,0,0,0,0,0,0,0,0,0,0,0,0,0,0,0]
[354,1,0,0,0,0,0,0,0,0,0,0,0,0,0,0,0,0,0,0,0,0,0]
[356,1,1,0,0,0,0,0,0,0,0,0,0,0,0,109583,0,0,109583,8.2959999999999994,109581.03,152,468548.94]
[361,1,1,0,0,0,0,0,0,110104.83,0,0,110104.83,1.47,110114.27,1245874.44,0,0,1245874.44,16.632999999999999,1245939.27,158137,1776961.12]
[362,1,1,388175.55,0,0,388175.55,28.754999999999999,388181,0,0,0,0,0,0,495280.73,0,0,495280.73,36.689,495286.83,5343,560630.63]
[363,1,1,183681.34,0,0,183681.34,11.266,183686.38,0,0,0,0,0,0,378397.89,0,0,378397.89,23.207999999999998,378394.6,2705,384748.75]
[371,1,0,0,0,0,0,0,0,0,0,0,0,0,0,0,0,0,0,0,0,0,0]
[376,1,0,0,0,0,0,0,0,0,0,0,0,0,0,0,0,0,0,0,0,0,0]
[377,1,0,0,0,0,0,0,0,0,0,0,0,0,0,0,0,0,0,0,0,0,0]
[378,1,1,181148,0,0,181148,2.4260000000000002,181182.05,0,0,0,0,0,0,701138,0,0,701138,9.3879999999999999,701128.24,50314,915604.74]
[381,1,1,2372935.5099999998,0,-83295.199999999997,2289640.31,10.811999999999999,2286469.54,146564.18,0,-5144.68,141419.5,0.66800000000000004,141265.41,3580816.6,0,-125547.25,3455269.35,16.315000000000001,3450217.4,64951,4561325.97]
[390,1,1,1082317,0,0,1082317,22.46,1082368.06,5525,0,0,5525,0.115,5541.96,1560415,0,0,1560415,32.383000000000003,1560566.56,8306,1916875.13]
[391,1,1,0,0,0,0,0,0,0,0,0,0,0,0,333215.84000000003,0,0,333215.84000000003,6.72,333275.17,7395,1111745.31]
[392,1,0,0,0,0,0,0,0,0,0,0,0,0,0,0,0,0,0,0,0,0,0]
[393,1,0,0,0,0,0,0,0,0,0,0,0,0,0,0,0,0,0,0,0,0,0]
[394,1,0,0,0,0,0,0,0,0,0,0,0,0,0,0,0,0,0,0,0,0,0]
[395,1,0,0,0,0,0,0,0,0,0,0,0,0,0,0,0,0,0,0,0,0,0]
[402,1,1,0,0,0,0,0,0,167075,0,0,167075,5.766,167084.84,282383,0,0,282383,9.7469999999999999,282444.67,872,682995.91]
[403,1,1,584279,0,0,584279,13.574999999999999,584353.79,171878,0,0,171878,3.9929999999999999,171883.96,865029,0,0,865029,20.097999999999999,865144.94,6156,1070985.8799999999]
[404,1,1,292434,0,0,292434,5.4950000000000001,292512.75,0,0,0,0,0,0,448616,0,0,448616,8.43,448750.23,10055,870493.36]
[408,1,0,0,0,0,0,0,0,0,0,0,0,0,0,0,0,0,0,0,0,0,0]
[409,1,0,0,0,0,0,0,0,0,0,0,0,0,0,0,0,0,0,0,0,0,0]
[411,1,0,0,0,0,0,0,0,0,0,0,0,0,0,0,0,0,0,0,0,0,0]
[412,1,0,0,0,0,0,0,0,0,0,0,0,0,0,0,0,0,0,0,0,0,0]
[413,1,1,2517632,0,0,2517632,13.586,2517885.5,218491,0,0,218491,1.179,218503.39,5005769,0,0,5005769,27.013000000000002,5006303.62,3894,6629869.0700000003]
[414,1,1,186822,0,0,186822,2.9820000000000002,186866.31,485736,0,0,485736,7.7519999999999998,485777.22,1090098,0,0,1090098,17.399000000000001,1090304.1499999999,3047,1296694.3500000001]
[415,1,1,0,0,0,0,0,0,0,0,0,0,0,0,172459,0,0,172459,6.524,172548.91,1593,387467.85]
[417,1,0,0,0,0,0,0,0,0,0,0,0,0,0,0,0,0,0,0,0,0,0]
[418,1,0,0,0,0,0,0,0,0,0,0,0,0,0,0,0,0,0,0,0,0,0]
[421,1,0,0,0,0,0,0,0,0,0,0,0,0,0,0,0,0,0,0,0,0,0]
[422,1,0,0,0,0,0,0,0,0,0,0,0,0,0,0,0,0,0,0,0,0,0]
[423,1,1,2736755.44,-0.44,0,2736755,16.408000000000001,2736750.7,0,0,0,0,0,0,4291356.12,-0.12,0,4291356,25.728000000000002,4291267.8,23160,6542235.8899999997]
[424,1,1,0,0,0,0,0,0,169557.24,-0.24,-3,169554,6.2030000000000003,169561.61,309673.83,0.17,-6,309668,11.329000000000001,309682.98,2816,792008.34]
[425,1,0,0,0,0,0,0,0,0,0,0,0,0,0,0,0,0,0,0,0,0,0]
[426,1,0,0,0,0,0,0,0,0,0,0,0,0,0,0,0,0,0,0,0,0,0]
[427,1,0,0,0,0,0,0,0,0,0,0,0,0,0,0,0,0,0,0,0,0,0]
[432,1,1,0,0,0,0,0,0,427073.21,0,0,427073.21,12.212,427104.44,695683.14,0,0,695683.14,19.893999999999998,695775.94,40457,806277.15]
[435,1,1,604279.68999999994,0,0,604279.68999999994,11.15,604327.77,48820.05,0,0,48820.05,0.90100000000000002,48834.02,840935.13,0,0,840935.13,15.518000000000001,841072.5,9247,1072298.28]
[436,1,0,0,0,0,0,0,0,0,0,0,0,0,0,0,0,0,0,0,0,0,0]
[437,1,0,0,0,0,0,0,0,0,0,0,0,0,0,0,0,0,0,0,0,0,0]
[440,1,0,0,0,0,0,0,0,0,0,0,0,0,0,0,0,0,0,0,0,0,0]
[441,1,1,0,0,0,0,0,0,0,0,0,0,0,0,278388.42,0,0,278388.42,5.95,278505.34000000003,104,912280.1]
[442,1,0,0,0,0,0,0,0,0,0,0,0,0,0,0,0,0,0,0,0,0,0]
[443,1,0,0,0,0,0,0,0,0,0,0,0,0,0,0,0,0,0,0,0,0,0]
[444,1,0,0,0,0,0,0,0,0,0,0,0,0,0,0,0,0,0,0,0,0,0]
[446,1,0,0,0,0,0,0,0,0,0,0,0,0,0,0,0,0,0,0,0,0,0]
[447,1,1,0,0,0,0,0,0,0,0,0,0,0,0,207573.92,0,0,207573.92,12.263999999999999,207604.87,741,279795.26]
[451,1,0,0,0,0,0,0,0,0,0,0,0,0,0,0,0,0,0,0,0,0,0]
[453,1,0,0,0,0,0,0,0,0,0,0,0,0,0,0,0,0,0,0,0,0,0]
[454,1,0,0,0,0,0,0,0,0,0,0,0,0,0,0,0,0,0,0,0,0,0]
[456,1,0,0,0,0,0,0,0,0,0,0,0,0,0,0,0,0,0,0,0,0,0]
[457,1,0,0,0,0,0,0,0,0,0,0,0,0,0,0,0,0,0,0,0,0,0]
[458,1,1,0,0,0,0,0,0,92585.74,0,0,92585.74,1.4450000000000001,92613,382782.75,0,0,382782.75,5.9729999999999999,382821.76,13330,911451.94]
[459,1,0,0,0,0,0,0,0,0,0,0,0,0,0,0,0,0,0,0,0,0,0]
[460,1,0,0,0,0,0,0,0,0,0,0,0,0,0,0,0,0,0,0,0,0,0]
[461,1,0,0,0,0,0,0,0,0,0,0,0,0,0,0,0,0,0,0,0,0,0]
[463,1,1,1172274.05,0,0,1172274.05,22.256,1172280.94,174319.72,0,0,174319.72,3.31,174346.23999999999,1556046.78,0,0,1556046.78,29.544,1556158.71,6406,2016230.36]
[464,1,0,0,0,0,0,0,0,0,0,0,0,0,0,0,0,0,0,0,0,0,0]
[465,1,1,2083988.24,0,0,2083988.24,16.959,2084027.91,168289.86,0,0,168289.86,1.37,168354.16,3153984.36,0,0,3153984.36,25.669,3154367.16,1080,4063356.6]
[466,1,1,870340.69,0,0,870340.69,8.3460000000000001,870505.91,0,0,0,0,0,0,1608009.53,0,0,1608009.53,15.419,1608235.16,3401,2665441.77]
[473,1,1,0,0,0,0,0,0,0,0,0,0,0,0,481560,0,0,481560,9.5779999999999994,481630.89,0,1126014.1499999999]
[477,1,1,2773137,0,0,2773137,18.251000000000001,2773386.37,546381,0,0,546381,3.5960000000000001,546441.15,4971037,0,0,4971037,32.716999999999999,4971611.53,22635,6725100.5599999996]
[480,1,1,889347,0,0,889347,13.164,889427.63,32075,0,0,32075,0.47499999999999998,32093.45,1331080,0,0,1331080,19.704000000000001,1331303.72,1563,1774068.63]
[482,1,1,891556,0,0,891556,6.9770000000000003,891556,1060734,0,0,1060734,8.3010000000000002,1060734.04,2733892,0,0,2733892,21.395,2733892.13,0,4392473.82]
[483,1,0,0,0,0,0,0,0,0,0,0,0,0,0,0,0,0,0,0,0,0,0]
[484,1,1,283268,0,0,283268,6.024,283268.02,0,0,0,0,0,0,883586,0,0,883586,18.789000000000001,883586.03,0,1247487.0900000001]
[485,1,1,1277621,0,0,1277621,36.267000000000003,1277620.99,50369,0,0,50369,1.43,50369,1532586,0,0,1532586,43.505000000000003,1532585.99,0,2005199.82]
[486,1,1,416691,0,0,416691,19.294,416690.99,0,0,0,0,0,0,549858,0,0,549858,25.46,549858.01,0,744365.08]
[487,1,1,588011,0,0,588011,34.302,588010.99,0,0,0,0,0,0,685011,0,0,685011,39.960999999999999,685011,0,1008111.08]
[492,1,1,1750490.57,0.43,0,1750491,10.324,1755958.06,603802.51,0.49,0,603803,3.5609999999999999,605672.86,4552707.63,1.37,0,4552709,26.888999999999999,4573206.01,127424,6538920.5700000003]
[495,1,1,905345.44,-0.44,0,905345,20.382000000000001,904858.07,0,0,0,0,0,0,1108709.6100000001,-0.61,0,1108709,24.960999999999999,1108115.07,10491,1404482.61]
[497,1,1,533978,0,0,533978,22.385000000000002,533975.67000000004,0,0,0,0,0,0,596519.80000000005,0,0,596519.80000000005,25.006,596510.86,6921,695686.9]
[499,1,1,211981.41,0,0,211981.41,4.3630000000000004,211979.38,0,0,0,0,0,0,901887.1,0,0,901887.1,18.562000000000001,901874.4,5620,1310257.82]
[500,1,1,0,0,0,0,0,0,0,0,0,0,0,0,442296.03,-0.03,0,442296,5.202,442295.52,13884,1141234.76]
[504,1,0,0,0,0,0,0,0,0,0,0,0,0,0,0,0,0,0,0,0,0,0]
[505,1,1,0,0,0,0,0,0,0,0,0,0,0,0,342116.74,0,0,342116.74,4.2640000000000002,342186.95,10743,1092658.7]
[507,1,1,549353.27,0,0,549353.27,8.8640000000000008,549352.85,0,0,0,0,0,0,782358.81,0,0,782358.81,12.624000000000001,782359.54,322,1299069.56]
[508,1,1,3053807.61,0,0,3053807.61,25.832000000000001,3053819.78,106384.78,0,0,106384.78,0.90100000000000002,106396.63,4533740.99,0,0,4533740.99,38.350999999999999,4533678.72,5207,6043122.8600000003]
[511,1,1,541479.14,0,0,541479.14,7.1680000000000001,541592.72,0,0,0,0,0,0,936625.9,0,0,936625.9,12.398999999999999,936831.49,11344,1319751.21]
[513,1,0,0,0,0,0,0,0,0,0,0,0,0,0,0,0,0,0,0,0,0,0]
[514,1,1,0,0,0,0,0,0,0,0,0,0,0,0,111866.54,0,0,111866.54,3.157,111921.37,1270,242067.46]
[516,1,0,0,0,0,0,0,0,0,0,0,0,0,0,0,0,0,0,0,0,0,0]
[518,1,1,1308849.22,0,0,1308849.22,6.88,1309066.54,141104.22,0,0,141104.22,0.74199999999999999,141181.29999999999,2955165.79,0,0,2955165.79,15.534000000000001,2955674.36,73207,4776733.47]
[521,1,0,0,0,0,0,0,0,0,0,0,0,0,0,0,0,0,0,0,0,0,0]
[522,1,0,0,0,0,0,0,0,0,0,0,0,0,0,0,0,0,0,0,0,0,0]
[523,1,0,0,0,0,0,0,0,0,0,0,0,0,0,0,0,0,0,0,0,0,0]
[524,1,0,0,0,0,0,0,0,0,0,0,0,0,0,0,0,0,0,0,0,0,0]
[525,1,0,0,0,0,0,0,0,0,0,0,0,0,0,0,0,0,0,0,0,0,0]
[526,1,0,0,0,0,0,0,0,0,0,0,0,0,0,0,0,0,0,0,0,0,0]
[531,1,1,3274875,0,0,3274875,36.061999999999998,3274938.8,88156,0,0,88156,0.97099999999999997,88180.51,3948588,0,0,3948588,43.481000000000002,3948688.75,2954,4895498.9000000004]
[533,1,1,1526583,0,0,1526583,28.225000000000001,1526651.58,43632,0,0,43632,0.80700000000000005,43649.52,1873054,0,0,1873054,34.631,1873143.34,5004,2373491.96]
[534,1,1,1724369,0,0,1724369,16.291,1723907.92,145823,0,0,145823,1.3779999999999999,145819.48000000001,2702278,0,0,2702278,25.53,2701575.67,3072,3882840.1]
[535,1,1,4438780,0,0,4438780,3.1150000000000002,4438832.42,4576433,0,0,4576433,3.2120000000000002,4577056.09,25451106,0,0,25451106,17.861999999999998,25453105.829999998,0,53915741.68]
[542,1,1,589206.57999999996,0,0,589206.57999999996,4.6289999999999996,589217.81999999995,0,0,0,0,0,0,1290802.24,0,0,1290802.24,10.141999999999999,1290958.54,649,1758906.68]
[543,1,0,0,0,0,0,0,0,0,0,0,0,0,0,0,0,0,0,0,0,0,0]
[544,1,1,2931932.53,0,0,2931932.53,14.473000000000001,2932000.11,156660,0,0,156660,0.77300000000000002,156597.53,4575169.3899999997,0,0,4575169.3899999997,22.686,4575140.67,6781,6664908.1600000001]
[545,1,1,0,0,0,0,0,0,0,0,0,0,0,0,388639.57,0,0,388639.57,8.5660000000000007,388616.55,1139,860512.34]
[547,1,1,303463.94,0,0,303463.94,7.7569999999999997,303479.21000000002,0,0,0,0,0,0,610324.59,0,0,610324.59,15.601000000000001,610362.14,1085,1099704.06]
[548,1,1,1311747.92,0,0,1311747.92,7.81,1311793.6100000001,771300.9,0,0,771300.9,4.5919999999999996,771287.61,2913049.57,0,0,2913049.57,17.343,2912988.04,0,3614930.09]
[549,1,1,3118607.24,0,0,3118607.24,16.146000000000001,3118686.28,0,0,0,0,0,0,4717006.49,0,0,4717006.49,24.420999999999999,4717046.8,0,6005948.0199999996]
[550,1,1,588784.25,0,0,588784.25,17.510000000000002,588785.82999999996,0,0,0,0,0,0,767435.88,0,0,767435.88,22.823,767439.12,485,871001.81]
[553,1,1,502102.11,0,0,502102.11,15.461,502109.58,86662.27,0,0,86662.27,2.669,86678.12,727160.38,0,0,727160.38,22.391999999999999,727199.9,7913,1014266.73]
[561,1,1,0,0,0,0,0,0,0,0,0,0,0,0,116899.8,0,0,116899.8,5.6550000000000002,116890.21,3678,358511.92]
[564,1,1,3137632.54,0,0,3137632.54,23.994,3137585.97,0,0,0,0,0,0,4469198.17,0,0,4469198.17,34.176000000000002,4469039.68,81314,5719348.6900000004]
[566,1,0,0,0,0,0,0,0,0,0,0,0,0,0,0,0,0,0,0,0,0,0]
[570,1,0,0,0,0,0,0,0,0,0,0,0,0,0,0,0,0,0,0,0,0,0]
[573,1,0,0,0,0,0,0,0,0,0,0,0,0,0,0,0,0,0,0,0,0,0]
[576,1,0,0,0,0,0,0,0,0,0,0,0,0,0,0,0,0,0,0,0,0,0]
[577,1,1,177153.27,0,0,177153.27,5.26,177148.91,205594.57,0,0,205594.57,6.1050000000000004,205607.24,579606.39,0,0,579606.39,17.21,579606.99,0,832675.96]
[578,1,1,953620.44,0,0,953620.44,11.097,953638.67,450478.26,0,0,450478.26,5.242,450479.76,2309212.69,0,0,2309212.69,26.870999999999999,2309202.92,0,3367522.55]
[581,1,1,0,0,0,0,0,0,0,0,0,0,0,0,314088.39,0,0,314088.39,6.2,314220.09000000003,13004,648812.07999999996]
[582,1,0,0,0,0,0,0,0,0,0,0,0,0,0,0,0,0,0,0,0,0,0]
[583,1,0,0,0,0,0,0,0,0,0,0,0,0,0,0,0,0,0,0,0,0,0]
[584,1,0,0,0,0,0,0,0,0,0,0,0,0,0,0,0,0,0,0,0,0,0]
[592,1,1,63674.62,0,0,63674.62,1.994,63663.63,0,0,0,0,0,0,190435.77,0,0,190435.77,5.9640000000000004,190416.21,2903,326104.21000000002]
[593,1,1,427640.62,0,0,427640.62,3.786,427641.31,612756.69999999995,0,0,612756.69999999995,5.4249999999999998,612771.81999999995,1761052.92,0,0,1761052.92,15.59,1760942.42,51885,3001311.84]
[595,1,1,1154779.47,0,0,1154779.47,9.0969999999999995,1154780,349851.26,0,0,349851.26,2.7559999999999998,349851,2549858.6,0,0,2549858.6,20.085999999999999,2549860.69,20214,3726183.61]
[597,1,0,0,0,0,0,0,0,0,0,0,0,0,0,0,0,0,0,0,0,0,0]
[599,1,1,0,0,0,0,0,0,0,0,0,0,0,0,307683.77,0,0,307683.77,5.8769999999999998,307667.94,2716,724335.93]
[600,1,1,236850.91,0,0,236850.91,5.3719999999999999,236850.84,0,0,0,0,0,0,677250.99,0,0,677250.99,15.36,677250.53,0,858399.53]
[601,1,1,0,0,0,0,0,0,562783.35,0,0,562783.35,14.683,562788.97,906117.1,0,0,906117.1,23.64,906104.41,7439,1328540.05]
[603,1,0,0,0,0,0,0,0,0,0,0,0,0,0,0,0,0,0,0,0,0,0]
[604,1,0,0,0,0,0,0,0,0,0,0,0,0,0,0,0,0,0,0,0,0,0]
[611,1,0,0,0,0,0,0,0,0,0,0,0,0,0,0,0,0,0,0,0,0,0]
[612,1,0,0,0,0,0,0,0,0,0,0,0,0,0,0,0,0,0,0,0,0,0]
[614,1,0,0,0,0,0,0,0,0,0,0,0,0,0,0,0,0,0,0,0,0,0]
[615,1,0,0,0,0,0,0,0,0,0,0,0,0,0,0,0,0,0,0,0,0,0]
[621,1,1,6884638,0,-742629,6142009,7.1529999999999996,6142008.9900000002,3593550,0,-387627,3205923,3.734,3205923,24355585,0,-2627176,21728409,25.306000000000001,21728408.969999999,0,39856516.520000003]
[622,1,1,4251404,0,-667971,3583433,4.7880000000000003,3583432.42,6361605,0,-999522,5362083,7.165,5362082.13,29816748,0,-4684741,25132007,33.582000000000001,25132002.940000001,0,41246440.590000004]
[623,1,1,2943873,0,-358539,2585334,4.3979999999999997,2585334.04,0,0,0,0,0,0,12646752,0,-1540264,11106488,18.893999999999998,11106488.17,0,22147147.66]
[624,1,1,3347034,0,-374206,2972828,4.2850000000000001,2972828.04,1132638,0,-126632,1006006,1.45,1006006.01,18339350,0,-2050382,16288968,23.475999999999999,16288968.210000001,0,32165760.870000001]
[625,1,1,0,0,0,0,0,0,36824998,0,-7889305,28935693,13.651,28935693.140000001,110211036,0,-23611366,86599670,40.856999999999999,86599670.379999995,331258,116073652.98]
[627,1,0,0,0,0,0,0,0,0,0,0,0,0,0,0,0,0,0,0,0,0,0]
[628,1,0,0,0,0,0,0,0,0,0,0,0,0,0,0,0,0,0,0,0,0,0]
[630,1,1,0,0,0,0,0,0,172757,0,0,172757,8.3849999999999998,172765.13,617387,0,0,617387,29.966999999999999,617442.17000000004,19428,1117647.1499999999]
[631,1,0,0,0,0,0,0,0,0,0,0,0,0,0,0,0,0,0,0,0,0,0]
[633,1,0,0,0,0,0,0,0,0,0,0,0,0,0,0,0,0,0,0,0,0,0]
[635,1,1,0,0,0,0,0,0,0,0,0,0,0,0,67616,0,0,67616,2.08,67700.36,2067,208734.58]
[636,1,0,0,0,0,0,0,0,0,0,0,0,0,0,0,0,0,0,0,0,0,0]
[637,1,0,0,0,0,0,0,0,0,0,0,0,0,0,0,0,0,0,0,0,0,0]
[638,1,0,0,0,0,0,0,0,0,0,0,0,0,0,0,0,0,0,0,0,0,0]
[640,1,1,680035,0,0,680035,8.4540000000000006,680191.59,0,0,0,0,0,0,1020702,0,0,1020702,12.689,1020931.05,6288,1302023.96]
[641,1,0,0,0,0,0,0,0,0,0,0,0,0,0,0,0,0,0,0,0,0,0]
[646,1,0,0,0,0,0,0,0,0,0,0,0,0,0,0,0,0,0,0,0,0,0]
[647,1,0,0,0,0,0,0,0,0,0,0,0,0,0,0,0,0,0,0,0,0,0]
[648,1,0,0,0,0,0,0,0,0,0,0,0,0,0,0,0,0,0,0,0,0,0]
[649,1,0,0,0,0,0,0,0,0,0,0,0,0,0,0,0,0,0,0,0,0,0]
[650,1,0,0,0,0,0,0,0,0,0,0,0,0,0,0,0,0,0,0,0,0,0]
[651,1,0,0,0,0,0,0,0,0,0,0,0,0,0,0,0,0,0,0,0,0,0]
[652,1,0,0,0,0,0,0,0,0,0,0,0,0,0,0,0,0,0,0,0,0,0]
[653,1,0,0,0,0,0,0,0,0,0,0,0,0,0,0,0,0,0,0,0,0,0]
[654,1,0,0,0,0,0,0,0,0,0,0,0,0,0,0,0,0,0,0,0,0,0]
[655,1,0,0,0,0,0,0,0,0,0,0,0,0,0,0,0,0,0,0,0,0,0]
[656,1,1,1709762.16,0,0,1709762.16,6.4470000000000001,1709836.08,653435.07999999996,0,0,653435.07999999996,2.464,653487.84,5813168.1799999997,0,0,5813168.1799999997,22.064,5813353.7199999997,20323,9133865.1600000001]
[657,1,0,0,0,0,0,0,0,0,0,0,0,0,0,0,0,0,0,0,0,0,0]
[659,1,1,4235870.0199999996,0,-14802.17,4221067.8499999996,16.050999999999998,4221169.83,726605.08,0,-2539.11,724065.97,2.7530000000000001,723997.29,8164302.3300000001,0,-28530,8135772.3300000001,30.937000000000001,8135962.2999999998,17153,15505713.42]
[669,1,0,0,0,0,0,0,0,0,0,0,0,0,0,0,0,0,0,0,0,0,0]
[670,1,0,0,0,0,0,0,0,0,0,0,0,0,0,0,0,0,0,0,0,0,0]
[671,1,1,749375,0,0,749375,10.468,749463.68,36608,0,0,36608,0.51200000000000001,36656.99,1062299,0,0,1062299,14.84,1062480.04,2871,1430487.38]
[676,1,1,0,0,0,0,0,0,0,0,0,0,0,0,116010,0,0,116010,12.577,116013.4,0,282967.15999999997]
[678,1,0,0,0,0,0,0,0,0,0,0,0,0,0,0,0,0,0,0,0,0,0]
[682,1,1,1381994,0,0,1381994,24.823,1381973.61,0,0,0,0,0,0,1989188,0,0,1989188,35.729999999999997,1989200.23,0,2590008.23]
[690,1,1,223189,0,0,223189,4.6539999999999999,223199.79,181312,0,0,181312,3.7810000000000001,181331.84,1783818,0,0,1783818,37.195,1783823.84,0,2205854.98]
[691,1,0,0,0,0,0,0,0,0,0,0,0,0,0,0,0,0,0,0,0,0,0]
[692,1,0,0,0,0,0,0,0,0,0,0,0,0,0,0,0,0,0,0,0,0,0]
[693,1,0,0,0,0,0,0,0,0,0,0,0,0,0,0,0,0,0,0,0,0,0]
[695,1,1,241417.85,0,-107804.26,133613.59,7.2229999999999999,133613.15,0,0,0,0,0,0,779969.17,0,-346577.31,433391.86,23.428999999999998,433396.44,129950,637047.31999999995]
[696,1,1,249717.07,0,-21170.19,228546.88,3.677,228552.76,0,0,0,0,0,0,1012504.17,0,-84991.12,927513.05,14.922000000000001,927512.71,94928,1476299.86]
[697,1,0,0,0,0,0,0,0,0,0,0,0,0,0,0,0,0,0,0,0,0,0]
[698,1,1,475097.49,0,0,475097.49,9.2880000000000003,475096.99,0,0,0,0,0,0,598498.24,0,0,598498.24,11.7,598474.89,13055,825191.56]
[699,1,0,0,0,0,0,0,0,0,0,0,0,0,0,0,0,0,0,0,0,0,0]
[700,1,1,2900168.6,0,0,2900168.6,19.457000000000001,2900221.7,0,0,0,0,0,0,3957973.66,0,0,3957973.66,26.553000000000001,3957937.33,78623,5605848.3200000003]
[701,1,1,0,0,0,0,0,0,474387.5,0,-106466.4,367921.1,3.9569999999999999,367954.94,1531675.9,0,-340278.71,1191397.19,12.811999999999999,1191366.8700000001,414341,1987779.51]
[704,1,1,1053404.1599999999,0,0,1053404.1599999999,9.5540000000000003,1053447.83,0,0,0,0,0,0,2614340.86,0,0,2614340.86,23.710999999999999,2614433.91,104868,3936608.09]
[706,1,1,0,0,0,0,0,0,0,0,0,0,0,0,771161.66,0,-214945.53,556216.13,10.772,556223.54,268044,1292923.3]
[707,1,1,40110.76,0,0,40110.76,37.097000000000001,40110.76,0,0,0,0,0,0,76217.69,0,0,76217.69,70.491,76217.69,0,76365.679999999993]
[708,1,0,0,0,0,0,0,0,0,0,0,0,0,0,0,0,0,0,0,0,0,0]
[709,1,1,0,0,0,0,0,0,18545520.640000001,0,0,18545520.640000001,24.434000000000001,18545886.620000001,24505861.030000001,0,0,24505861.030000001,32.286000000000001,24505709.059999999,1858295,29957477.280000001]
[710,1,0,0,0,0,0,0,0,0,0,0,0,0,0,0,0,0,0,0,0,0,0]
[712,1,1,241141.52,0,-3966.38,237175.14,6.8259999999999996,237162.75,0,0,0,0,0,0,246747.14,0,-3966.38,242780.76,6.9870000000000001,242756.54,33564,248085.2]
[716,1,1,2851677,0,-348295.82,2503381.1800000002,25.497,2503381,299496,0,-36579.5,262916.5,2.6779999999999999,262916,3967969,0,-484637,3483332,35.478000000000002,3483331,0,4353952.95]
[717,1,1,3314629,0,-438008,2876621,27.077000000000002,2876621,0,0,0,0,0,0,4138170,0,-546834,3591336,33.805,3591336,3300,4760359.95]
[719,1,1,11388019,0,-1026173,10361846,20.887,10361846,1502328,0,-135375,1366953,2.7559999999999998,1366953,16718381,0,-1506492,15211889,30.664000000000001,15211889,2575,25262619.289999999]
[720,1,1,19004667,0,-2225881,16778786,34.28,16778786,0,0,0,0,0,0,27321862,0,-3200015,24121847,49.281999999999996,24121847,280,29408800.710000001]
[721,1,1,7041040,0,-226049,6814991,30.95,6814991,294614,0,-9458,285156,1.2949999999999999,285156,8452213,0,-271353,8180860,37.152999999999999,8180860,22925,11601944.76]
[726,1,1,3393267.67,0,0,3393267.67,14.321,3393369.97,190417.24,0,0,190417.24,0.80400000000000005,190508.31,5526006.2000000002,0,0,5526006.2000000002,23.321999999999999,5526162.5999999996,0,9705062.1699999999]
[727,1,1,3903608.71,0,0,3903608.71,28.841999999999999,3903282.75,171269.7,0,0,171269.7,1.2649999999999999,171196.61,5985563.1500000004,0,0,5985563.1500000004,44.223999999999997,5984979.4199999999,0,8656581.9100000001]
[728,1,1,21186531.859999999,0,-554648.18000000005,20631883.68,28.622,20632078.829999998,763493.8,0,-19987.72,743506.08,1.0309999999999999,743193.11,27136032.100000001,0,-710401.82,26425630.280000001,36.658999999999999,26425525.039999999,0,39262820.460000001]
[731,1,0,0,0,0,0,0,0,0,0,0,0,0,0,0,0,0,0,0,0,0,0]
[732,1,0,0,0,0,0,0,0,0,0,0,0,0,0,0,0,0,0,0,0,0,0]
[733,1,0,0,0,0,0,0,0,0,0,0,0,0,0,0,0,0,0,0,0,0,0]
[734,1,0,0,0,0,0,0,0,0,0,0,0,0,0,0,0,0,0,0,0,0,0]
[735,1,0,0,0,0,0,0,0,0,0,0,0,0,0,0,0,0,0,0,0,0,0]
[736,1,0,0,0,0,0,0,0,0,0,0,0,0,0,0,0,0,0,0,0,0,0]
[737,1,0,0,0,0,0,0,0,0,0,0,0,0,0,0,0,0,0,0,0,0,0]
[738,1,1,0,0,0,0,0,0,403009,0,0,403009,9.4489999999999998,403009,1506124,0,0,1506124,35.314999999999998,1506124,4979,2145129.9700000002]
[739,1,1,715220,0,0,715220,13.726000000000001,715220,20284,0,0,20284,0.38900000000000001,20284,1172950,0,0,1172950,22.510999999999999,1172950,3191,1902855.98]
[740,1,1,0,0,0,0,0,0,667332,0,0,667332,7.1,667332,1468544,0,0,1468544,15.624000000000001,1468544,8453,2288331.91]
[741,1,1,843196,0,0,843196,10.484999999999999,843196,0,0,0,0,0,0,1569653,0,0,1569653,19.518000000000001,1569653,2695,2250656.9700000002]
[742,1,1,9285733,0,0,9285733,11.939,9285733,3445845,0,0,3445845,4.43,3445845,23724973,0,0,23724973,30.504999999999999,23724973,24425,30976173.140000001]
[743,1,1,682018,0,0,682018,7.2069999999999999,682018,98523,0,0,98523,1.0409999999999999,98523,1604820,0,0,1604820,16.959,1604820,3745,3044668.97]
[745,1,1,2057426,0,0,2057426,22.622,2057426,268390,0,0,268390,2.9510000000000001,268390,3137225,0,0,3137225,34.494,3137225,2648,4130219.99]
[748,1,1,6629068,0,0,6629068,42.725999999999999,6629068,0,0,0,0,0,0,7672677,0,0,7672677,49.453000000000003,7672677,3496,9686677.9600000009]
[750,1,1,2089492,0,0,2089492,15.347,2089492,291939,0,0,291939,2.1440000000000001,291939,4125755,0,0,4125755,30.302,4125755,5781,5897295.96]
[756,1,1,1186855,0,0,1186855,16.103000000000002,1186880.47,100794,0,0,100794,1.3680000000000001,100829.19,1716175,0,0,1716175,23.286000000000001,1716307.43,4210,2062144.01]
[761,1,1,5940871,0,0,5940871,21.187999999999999,5940973.2400000002,120523,0,0,120523,0.43,120569.12,8660268,0,0,8660268,30.888999999999999,8661068.6500000004,33978,12976283.630000001]
[762,1,0,0,0,0,0,0,0,0,0,0,0,0,0,0,0,0,0,0,0,0,0]
[763,1,1,938155,0,0,938155,22.062999999999999,938197.08,8344,0,0,8344,0.19700000000000001,8377.14,1148165,0,0,1148165,27.004000000000001,1148305.94,1433,1629382.54]
[768,1,1,409829,0,0,409829,12.771000000000001,409852.55,28961,0,0,28961,0.90300000000000002,28979.47,567959.41,0,0,567959.41,18.983000000000001,609210.78,8669,793652.67]
[769,1,0,0,0,0,0,0,0,0,0,0,0,0,0,0,0,0,0,0,0,0,0]
[771,1,1,0,0,0,0,0,0,0,0,0,0,0,0,145721.62,0,0,145721.62,2.173,145949.95000000001,3530,505619.4]
[775,1,1,719987,0,0,719987,8.5299999999999994,720147.13,0,0,0,0,0,0,1157142,0,0,1157142,13.71,1157469.77,508,1453891.31]
[777,1,1,0,0,0,0,0,0,0,0,0,0,0,0,771082,0,0,771082,5.6479999999999997,771412.03,5608,1564685.48]
[784,1,0,0,0,0,0,0,0,0,0,0,0,0,0,0,0,0,0,0,0,0,0]
[786,1,1,372929.14,0,0,372929.14,26.341000000000001,372939.57,0,0,0,0,0,0,532982.6,0,0,532982.6,37.646999999999998,533011.5,5857,732611.65]
[787,1,1,136015.32999999999,0,0,136015.32999999999,7.3570000000000002,136047.19,0,0,0,0,0,0,280420.40999999997,0,0,280420.40999999997,15.167999999999999,280489.84000000003,6871,468881.4]
[789,1,0,0,0,0,0,0,0,0,0,0,0,0,0,0,0,0,0,0,0,0,0]
[790,1,0,0,0,0,0,0,0,0,0,0,0,0,0,0,0,0,0,0,0,0,0]
[791,1,0,0,0,0,0,0,0,0,0,0,0,0,0,0,0,0,0,0,0,0,0]
[792,1,0,0,0,0,0,0,0,0,0,0,0,0,0,0,0,0,0,0,0,0,0]
[793,1,0,0,0,0,0,0,0,0,0,0,0,0,0,0,0,0,0,0,0,0,0]
[801,1,1,0,0,0,0,0,0,0,0,0,0,0,0,85735.360000000001,-0.36,0,85735,6.0090000000000003,85767.66,5912,184272.25]
[803,1,1,0,0,0,0,0,0,287537.96999999997,0.03,0,287538,3.3969999999999998,287650.69,586986.61,0.39,0,586987,6.9340000000000002,587156.28,15554,922971.56]
[806,1,0,0,0,0,0,0,0,0,0,0,0,0,0,0,0,0,0,0,0,0,0]
[809,1,0,0,0,0,0,0,0,0,0,0,0,0,0,0,0,0,0,0,0,0,0]
[810,1,0,0,0,0,0,0,0,0,0,0,0,0,0,0,0,0,0,0,0,0,0]
[811,1,1,343724,0,0,343724,5.2519999999999998,343707.58,397383,0,0,397383,6.0720000000000001,397370.99,1067285,0,0,1067285,16.308,1067247.3799999999,5406,1769593.3]
[813,1,1,353007,0,0,353007,3.1120000000000001,352952.3,1038228,0,0,1038228,9.1539999999999999,1038215.1,2120802.66,0,0,2120802.66,18.699000000000002,2120776.06,3669,3487205.49]
[815,2,1,0,0,0,0,0,0,0,0,0,0,0,0,42669.05,0,0,42669.05,2.8940000000000001,42713.13,386,57653.72]
[818,1,1,301447,0,0,301447,20.873999999999999,301456.05,73143,0,0,73143,5.0650000000000004,73147.210000000006,404874,0,0,404874,28.036999999999999,404901.95,1075,489277.4]
[819,1,0,0,0,0,0,0,0,0,0,0,0,0,0,0,0,0,0,0,0,0,0]
[820,1,1,0,0,0,0,0,0,0,0,0,0,0,0,249662,0,0,249662,9.7620000000000005,249711.67,6009,484745.9]
[821,1,1,49526,0,0,49526,1.536,49549.78,195089,0,0,195089,6.048,195102.25,802846,0,0,802846,24.89,802925.77,6819,1116475.58]
[827,1,0,0,0,0,0,0,0,0,0,0,0,0,0,0,0,0,0,0,0,0,0]
[829,1,1,2307678,0,0,2307678,20.207999999999998,2307629.3199999998,354626,0,0,354626,3.105,354571.9,3286457,0,0,3286457,28.779,3286384.8,5004,4298503.26]
[830,1,0,0,0,0,0,0,0,0,0,0,0,0,0,0,0,0,0,0,0,0,0]
[831,1,1,8678904,0,-689738,7989166,16.420999999999999,7989166,0,0,0,0,0,0,16496423,0,-1311019,15185404,31.213000000000001,15185404,0,21197041.699999999]
[832,1,1,4808149,0,-280462,4527687,20.683,4527687,74320,0,-4335,69985,0.32,69985,7925568,0,-462302,7463266,34.094000000000001,7463266,0,12732297.859999999]
[833,1,1,26256445,0,-3230082,23026363,23.693999999999999,23026363,1834405,0,-225670,1608735,1.655,1608735,38018723,0,-4677085,33341638,34.308,33341637.989999998,0,63534276.780000001]
[834,1,1,3750288,0,-245187,3505101,3.931,3505101,1029437,0,-67303,962134,1.079,962134,19455319,0,-1271954,18183365,20.390999999999998,18183364.98,0,34737922.799999997]
[836,1,1,0,0,0,0,0,0,0,0,0,0,0,0,213123.38,0,0,213123.38,5.8659999999999997,213109.91,1178,472750.76]
[837,1,1,495757.24,0,0,495757.24,8.1739999999999995,495741.66,230387.6,0,0,230387.6,3.7989999999999999,230404.03,1062713.98,0,0,1062713.98,17.523,1062745.42,883,1532193.7]
[840,1,1,1174148.79,0,0,1174148.79,12.292,1174166.01,284347.51,0,0,284347.51,2.9769999999999999,284371.32,2309754.11,0,0,2309754.11,24.181000000000001,2309836.34,2505,2914544.85]
[846,1,1,0,0,0,0,0,0,792915.7,0,0,792915.7,8.2010000000000005,793032.76,1130600.6299999999,0,0,1130600.6299999999,11.695,1130900.8899999999,13328,1726831.17]
[850,1,1,1123463.32,0,0,1123463.32,33.738999999999997,1123520.51,0,0,0,0,0,0,1220905.24,0,0,1220905.24,36.667000000000002,1221023.93,282,1326790.94]
[852,1,1,0,0,0,0,0,0,249476.52,0,0,249476.52,3.5270000000000001,249609.92,387565.76,0,0,387565.76,5.4790000000000001,387755.24,75,653070.11]
[857,1,1,0,0,0,0,0,0,266167.28999999998,0,0,266167.28999999998,4.6859999999999999,266181.90000000002,671013.32999999996,0,0,671013.32999999996,11.813000000000001,671021.52,0,1178977.3]
[858,1,1,672186.07,0,0,672186.07,10.701000000000001,672199.58,33974.1,0,0,33974.1,0.54100000000000004,33983.74,1348513.8,0,0,1348513.8,21.469000000000001,1348607.87,3811,1872626.73]
[861,1,1,1901667.17,0,0,1901667.17,6.2489999999999997,1901561.2,318375.2,0,0,318375.2,1.046,318296.21000000002,6427289.8899999997,0,0,6427289.8899999997,21.12,6426783.9000000004,49681,12785617.25]
[876,1,1,2385146,0,0,2385146,14.951000000000001,2385087.13,0,0,0,0,0,0,3653158,0,0,3653158,22.9,3653166.7,2967,5141445.72]
[877,1,1,5335650,0,-68151,5267499,16.739999999999998,5267633.3899999997,579027,0,-7396,571631,1.8169999999999999,571761.64,10481913,0,-133883,10348030,32.887,10348665.43,1906,13756487.34]
[879,1,1,4805657,0,-83790,4721867,32.161000000000001,4721804.37,315059,0,-5493,309566,2.109,309638.55,6576924,0,-114674,6462250,44.015999999999998,6462328.3200000003,0,9202125.6500000004]
[880,1,0,0,0,0,0,0,0,0,0,0,0,0,0,0,0,0,0,0,0,0,0]
[881,1,1,1466674,0,0,1466674,25.338999999999999,1466676.05,45993,0,0,45993,0.79500000000000004,46016.32,2021569,0,0,2021569,34.926000000000002,2021592.32,0,2631435.85]
[882,1,1,2577886,0,0,2577886,7.1269999999999998,2578008.59,615257,0,0,615257,1.7010000000000001,615292.92000000004,5874959,0,0,5874959,16.242000000000001,5875124.96,0,11249718.82]
[883,1,1,3930443,0,-157384,3773059,35.942999999999998,3773091.98,158691,0,-6354,152337,1.4510000000000001,152317.74,4833377,0,-193540,4639837,44.2,4639864.9400000004,2965,5945873.6699999999]
[885,1,1,7841865,0,0,7841865,39.104999999999997,7841907.0999999996,0,0,0,0,0,0,9403641,0,0,9403641,46.893000000000001,9403670.8699999992,743,12493377.02]
[891,1,1,307609.3,0,0,307609.3,3.8420000000000001,307569.84999999998,181270.7,0,0,181270.7,2.2639999999999998,181243.66,902189.48,0,0,902189.48,11.27,902215.57,24685,1339897.06]
[892,1,0,0,0,0,0,0,0,0,0,0,0,0,0,0,0,0,0,0,0,0,0]
[893,1,0,0,0,0,0,0,0,0,0,0,0,0,0,0,0,0,0,0,0,0,0]
[894,1,0,0,0,0,0,0,0,0,0,0,0,0,0,0,0,0,0,0,0,0,0]
[896,1,0,0,0,0,0,0,0,0,0,0,0,0,0,0,0,0,0,0,0,0,0]
[911,1,1,5532715,0,0,5532715,25.693999999999999,5532715,520212,0,0,520212,2.4159999999999999,520212,8550979,0,0,8550979,39.710999999999999,8550979,22690,11273898.92]
[912,1,1,943180,0,0,943180,13.054,943296.27,465894,0,0,465894,6.4480000000000004,465939.51,2558566,0,0,2558566,35.411000000000001,2558837.46,0,3339410.4]
[913,1,0,0,0,0,0,0,0,0,0,0,0,0,0,0,0,0,0,0,0,0,0]
[914,1,1,528831.19999999995,0,0,528831.19999999995,13.698,528831,0,0,0,0,0,0,682963.31,0,0,682963.31,17.690000000000001,682963,2615,1164731]
[916,6,0,0,0,0,0,0,0,0,0,0,0,0,0,0,0,0,0,0,0,0,0]
[917,6,0,0,0,0,0,0,0,0,0,0,0,0,0,0,0,0,0,0,0,0,0]
[918,1,0,0,0,0,0,0,0,0,0,0,0,0,0,0,0,0,0,0,0,0,0]
[2071,1,1,1522614.44,0,0,1522614.44,13.151999999999999,1522619.54,135604.64000000001,0,0,135604.64000000001,1.171,135600.45000000001,2634985.17,0,0,2634985.17,22.760999999999999,2634987.7999999998,8328,3176499.99]
[2125,1,1,803420,0,0,803420,7.3120000000000003,803424.57,87212,0,0,87212,0.79400000000000004,87242.77,1417636,0,0,1417636,12.901999999999999,1417640.02,51316,1855455.46]
[2134,1,1,1974217.26,0,0,1974217.26,14.72,1974166.18,0,0,0,0,0,0,2500600.34,0,0,2500600.34,18.645,2500565.79,18747,3582252.22]
[2135,1,1,457567.39,0,0,457567.39,3.6749999999999998,457561.23,0,0,0,0,0,0,1391897.27,0,0,1391897.27,11.178000000000001,1391897.12,50214,1932627.75]
[2137,1,1,955533.49,-80.06,0,955453.43,14.124000000000001,955453.43,0,0,0,0,0,0,1355498.1,-80.06,0,1355418.04,20.036000000000001,1355385.5,73031,1678627.45]
[2142,1,1,2707265.97,0,-98020.7,2609245.27,8.5210000000000008,2609168.54,0,0,0,0,0,0,5415730.7400000002,0,-196084.92,5219645.82,17.045999999999999,5219561.9000000004,87944,6694082.75]
[2143,1,1,0,0,0,0,0,0,0,0,0,0,0,0,472980.46,0,0,472980.46,5.3280000000000003,472993.21,21391,1923923.78]
[2144,1,1,3027078.3,0,-7012,3020066.3,14.4,3020068.88,0,0,0,0,0,0,5112932.6100000003,0,-11844,5101088.6100000003,24.323,5101093.8600000003,662,8374747.7199999997]
[2148,1,0,0,0,0,0,0,0,0,0,0,0,0,0,0,0,0,0,0,0,0,0]
[2149,1,1,237689,0,0,237689,1.5429999999999999,237768.03,858642,0,0,858642,5.5730000000000004,858769.43,2664790,0,0,2664790,17.297999999999998,2665529.08,27264,3812985.28]
[2153,1,0,0,0,0,0,0,0,0,0,0,0,0,0,0,0,0,0,0,0,0,0]
[2154,1,1,81826.28,0,-12484.73,69341.55,1.639,69323.289999999994,0,0,0,0,0,0,122173.16,0,-17465.14,104708.02,2.4750000000000001,104682.82,51981,535380.39]
[2155,1,1,490996,0,0,490996,10.821,490973.01,0,0,0,0,0,0,881293,0,0,881293,19.425000000000001,881355.76,22236,1312077.57]
[2159,1,1,0,0,0,0,0,0,0,0,0,0,0,0,453498.08,0,0,453498.08,3.4319999999999999,453890.68,28477,1005711.84]
[2163,1,0,0,0,0,0,0,0,0,0,0,0,0,0,0,0,0,0,0,0,0,0]
[2164,1,1,749437.6,0,0,749437.6,7.8719999999999999,749438,187546.68,0,0,187546.68,1.97,187547,1591077.49,0,0,1591077.49,16.712,1591078,6370,2560370.9500000002]
[2165,1,1,0,0,0,0,0,0,964122.04,0,0,964122.04,13.544,964136.28,1482375.51,0,0,1482375.51,20.824999999999999,1482437.84,491,2029394.37]
[2167,1,1,1295307,0,0,1295307,16.478999999999999,1295339.54,0,0,0,0,0,0,1631498,0,0,1631498,20.757999999999999,1631692.35,2036,1913581.47]
[2168,1,1,0,0,0,0,0,0,398591,0,0,398591,3.74,398599.33,815134,0,0,815134,7.6479999999999997,815103.66,4489,1370976.85]
[2169,1,1,0,0,0,0,0,0,12458.21,0,0,12458.21,0.104,12466.74,572108.06999999995,0,0,572108.06999999995,4.7750000000000004,572391.23,26381,1330201.5]
[2170,1,1,0,0,0,0,0,0,197700,0,0,197700,2.0819999999999999,197721.13,1134843.32,0,0,1134843.32,13.015000000000001,1235994.46,24291,1865576.23]
[2171,1,1,378231,0,0,378231,3.8410000000000002,378197.11,0,0,0,0,0,0,667221,0,0,667221,6.7759999999999998,667186.56999999995,2755,1283628.3899999999]
[2172,1,1,1022438,0,0,1022438,10.724,1022452,256155.22,-0.22,0,256155,2.6869999999999998,256185.06,2053459.94,0.06,0,2053460,21.538,2053484.82,7508,2712249.62]
[2174,1,1,174301.41,0,0,174301.41,1.2330000000000001,174254.27,152220.46,0,0,152220.46,1.077,152207.5,769712.62,0,0,769712.62,5.4470000000000001,769799.67,937,1499137.3]
[2176,1,1,0,0,0,0,0,0,273778.19,0,0,273778.19,2.5510000000000002,273831.05,619197.89,0,0,619197.89,5.7709999999999999,619474.31000000006,4360,1392677.81]
[2180,1,1,0,0,0,0,0,0,611989.69999999995,0,0,611989.69999999995,4.5229999999999997,612124.77,1328318.92,0,0,1328318.92,9.8170000000000002,1328593.6000000001,11758,2278714.81]
[2183,1,0,0,0,0,0,0,0,0,0,0,0,0,0,0,0,0,0,0,0,0,0]
[2184,1,1,899037,0,0,899037,5.8470000000000004,899165.52,0,0,0,0,0,0,1651522,0,0,1651522,10.741,1651776.44,4235,2478938.5099999998]
[2190,1,1,0,0,0,0,0,0,918619,0,0,918619,5.5949999999999998,918682.55,1593628.88,0,0,1593628.88,9.7059999999999995,1593696.67,21631,2562808.42]
[2198,1,1,0,0,0,0,0,0,582359.31999999995,-153.41999999999999,0,582205.9,7.8239999999999998,582205.9,936863.47,-153.41999999999999,0,936710.05,12.587,936634.16,72949,1506033.25]
[2215,1,1,0,0,0,0,0,0,0,0,0,0,0,0,178263.52,0,0,178263.52,5.7270000000000003,178336.09,7865,487641.73]
[2310,1,1,2575349,0,0,2575349,21.628,2575307.17,0,0,0,0,0,0,3361538.43,0,0,3361538.43,28.231000000000002,3361545.07,34836,3910389.81]
[2311,1,1,768017,0,0,768017,9.0670000000000002,768016.88,0,0,0,0,0,0,1006257,0,0,1006257,11.88,1006257.13,9185,1553828.54]
[2342,1,1,0,0,0,0,0,0,130524.84,0,0,130524.84,1.109,130574.46,661613.63,0,0,661613.63,5.6219999999999999,661938.32999999996,4324,2070572.35]
[2358,1,1,116776,0,0,116776,4.4429999999999996,116780.88,103404,0,0,103404,3.9340000000000002,103402.2,337246,0,0,337246,12.831,337253.08,3477,788589.22]
[2359,1,0,0,0,0,0,0,0,0,0,0,0,0,0,0,0,0,0,0,0,0,0]
[2364,1,1,153769,0,0,153769,2.1949999999999998,153769,149323,0,0,149323,2.1320000000000001,149323,532042,0,0,532042,7.5960000000000001,532042,3231,942908.99]
[2365,1,1,297868.46000000002,0,0,297868.46000000002,1.7949999999999999,297933.17,0,0,0,0,0,0,1204987.6299999999,0,0,1204987.6299999999,7.26,1205011.03,33111,1647394.29]
[2396,1,1,0,0,0,0,0,0,0,0,0,0,0,0,904136.94,0,0,904136.94,6.7469999999999999,904350.74,20867,1628418.58]
[2397,1,1,1115224.46,0,-252.75,1114971.71,11.454000000000001,1114961.8,71851.44,0,-16.29,71835.149999999994,0.73799999999999999,71838.820000000007,1866365.11,0,-423,1865942.11,19.169,1865959.73,15695,2705946.46]
[2448,1,1,0,0,0,0,0,0,878702.71,0,0,878702.71,6.3230000000000004,878648.25,1329384.1200000001,0,0,1329384.1200000001,9.6720000000000006,1329374.42,19524,2200276.1]
[2527,1,1,0,0,0,0,0,0,0,0,0,0,0,0,218915.41,0,0,218915.41,4.8819999999999997,218969.9,1484,417165.74]
[2534,1,1,444460.48,0,0,444460.48,3.6850000000000001,444566.21,0,0,0,0,0,0,1131545.8899999999,0,0,1131545.8899999999,9.3819999999999997,1131864.3600000001,26271,1502856.08]
[2536,1,1,470491.8,0,0,470491.8,6.2290000000000001,470471.08,0,0,0,0,0,0,701467.92,0,0,701467.92,9.2870000000000008,701439.22,264,1397082.64]
[2580,1,1,1488726.54,0,0,1488726.54,28.864999999999998,1488722.77,0,0,0,0,0,0,2089668.43,0,0,2089668.43,40.517000000000003,2089678.87,447,2365810.25]
[2609,1,1,767287.26,0,0,767287.26,16.081,767286.1,49448,0,0,49448,1.036,49430.61,1089893.56,0,0,1089893.56,22.841999999999999,1089873.1599999999,7083,1474692.14]
[2683,1,1,0,0,0,0,0,0,29250,0,0,29250,1.0489999999999999,29239.1,207519,0,0,207519,7.4450000000000003,207516.79,0,428994.39]
[2687,1,1,2976304,0,-603,2975701,33.764000000000003,2975695.6,0,0,0,0,0,0,3616792,0,-733,3616059,41.029000000000003,3615976.04,5043,4472353.67]
[2689,1,1,1513396.4,0,0,1513396.4,8.2970000000000006,1513545.05,0,0,0,0,0,0,2247906.9900000002,0,0,2247906.9900000002,12.324999999999999,2248335.88,54189,3131265.32]
[2711,1,1,711994.2,0,-64553.21,647440.99,10.523,647432.1,0,0,0,0,0,0,1938411.13,0,-173201.42,1765209.71,28.69,1765164.59,221472,2081157.65]
[2752,1,1,1879592.67,0,0,1879592.67,12.930999999999999,1879652.88,523637.51,0,0,523637.51,3.6019999999999999,523587.48,3756665.8,0,0,3756665.8,25.844000000000001,3756689.28,30960,5368052.5199999996]
[2753,1,1,603512,0,0,603512,9.3490000000000002,603519.46,0,0,0,0,0,0,1185411,0,0,1185411,18.364000000000001,1185477.73,3524,1827581.55]
[2754,1,1,586117,0,0,586117,7.05,586153.14,123372,0,0,123372,1.484,123383.16,1123141,0,0,1123141,13.510999999999999,1123335.48,23231,1358588.94]
[2758,1,0,0,0,0,0,0,0,0,0,0,0,0,0,0,0,0,0,0,0,0,0]
[2759,1,1,38551,0,0,38551,2.27,38580.620000000003,0,0,0,0,0,0,76382.55,0,0,76382.55,4.4969999999999999,76430.429999999993,30772,136206.14000000001]
[2769,1,1,1781363.31,0,0,1781363.31,16.277000000000001,1781396.39,382481.39,0,0,382481.39,3.4950000000000001,382501.71,2750742.75,0,0,2750742.75,25.137,2751057.38,48328,3411283.76]
[2805,1,1,0,0,0,0,0,0,880486,0,0,880486,10.422000000000001,880508.19,1903979,0,0,1903979,22.536000000000001,1903965.91,12760,3177882.92]
[2835,1,1,800305,0,0,800305,8.7360000000000007,800308.1,119193,0,0,119193,1.3009999999999999,119185.08,1409884,0,0,1409884,15.39,1409883.43,5682,2494011.7400000002]
[2853,1,1,0,0,0,0,0,0,113545,0,0,113545,0.65100000000000002,113465.17,1209081,0,0,1209081,6.9370000000000003,1209075.1100000001,57391,1725043.66]
[2854,1,1,224656.46,0,0,224656.46,3.1589999999999998,224653.33,145235.82,0,0,145235.82,2.0430000000000001,145288.62,826838.67,0,0,826838.67,11.628,826929.06,9559,969876.44]
[2856,1,1,0,0,0,0,0,0,160798.41,0,0,160798.41,1.6950000000000001,160856.64000000001,451268.55,0,0,451268.55,4.7569999999999997,451442.49,0,936578.75]
[2859,1,1,1401523.23,-0.23,-30,1401493,10.048999999999999,1401426.2,0,0,0,0,0,0,2421397.75,0.25,-51,2421347,17.361999999999998,2421291.84,33807,3516868.96]
[2860,1,1,0,0,0,0,0,0,463559.21,0,0,463559.21,2.7029999999999998,463556.85,1783344.61,0,0,1783344.61,10.398999999999999,1783399.08,74229,2251252.15]
[2862,1,0,0,0,0,0,0,0,0,0,0,0,0,0,0,0,0,0,0,0,0,0]
[2884,1,1,0,0,0,0,0,0,0,0,0,0,0,0,291204.5,0.5,0,291205,2.2519999999999998,291310.94,8749,862614.73]
[2886,1,1,0,0,0,0,0,0,0,0,0,0,0,0,218748.03,0,0,218748.03,3.74,218777.47,2979,1170223.26]
[2887,1,0,0,0,0,0,0,0,0,0,0,0,0,0,0,0,0,0,0,0,0,0]
[2888,1,1,0,0,0,0,0,0,0,0,0,0,0,0,479627.56,0,0,479627.56,4.4379999999999997,479957.36,10781,689434.71]
[2889,1,1,1341844.43,0,0,1341844.43,11.387,1341843.23,0,0,0,0,0,0,1710212,0,0,1710212,14.513,1710210.53,3660,2536595.25]
[2890,1,1,297606.52,0,0,297606.52,2.3420000000000001,297625.65000000002,389916.8,0,0,389916.8,3.069,390014.14,1338871.46,0,0,1338871.46,10.538,1339188.3400000001,24009,2118279.71]
[2895,1,1,1397639.06,-0.06,0,1397639,6.7460000000000004,1397647.55,0,0,0,0,0,0,2337972.42,-0.42,0,2337972,11.285,2338045.15,59751,3234017.87]
[2897,1,1,1605360,0,0,1605360,13.13,1605288.37,0,0,0,0,0,0,2332729,0,0,2332729,19.081,2332864.23,19947,2992578.77]
[2898,1,1,0,0,0,0,0,0,0,0,0,0,0,0,342267.01,-0.01,0,342267,3.6240000000000001,342502.42,1773,540829.16]
[2899,1,1,268547,0,0,268547,2.58,268576.07,212908,0,0,212908,2.0449999999999999,212882.97,1294735,0,0,1294735,12.436999999999999,1294682.3799999999,4499,2075327.91]
[2902,1,1,0,0,0,0,0,0,0,0,0,0,0,0,509833,0,0,509833,5.85,510005.98,17551,770863.7]
[2903,1,1,738766.55,0,0,738766.55,11.611000000000001,738724.1,52500,0,0,52500,0.82599999999999996,52552.42,1070229.8799999999,0,0,1070229.8799999999,16.824000000000002,1070389.6499999999,45091,1237090.6100000001]
[2904,1,1,230978,0,0,230978,1.716,231099.85,0,0,0,0,0,0,1000020,0,0,1000020,7.4279999999999999,1000355.28,20533,1530795]
[2905,1,1,3178027.31,0,0,3178027.31,23.274999999999999,3178034.83,41166.980000000003,0,0,41166.980000000003,0.30099999999999999,41099.4,4318302.75,0,0,4318302.75,31.626000000000001,4318304.17,38569,5327676.2]
[2906,1,1,0,0,0,0,0,0,296194,0,0,296194,4.891,296143.94,869711,0,0,869711,14.365,869782.79,6919,1378858.64]
[2907,1,1,0,0,0,0,0,0,31605,0,0,31605,0.47299999999999998,31607,233680.62,0,0,233680.62,3.4990000000000001,233811.59,1359,587482.04]
[2908,1,1,0,0,0,0,0,0,0,0,0,0,0,0,385527.37,0,0,385527.37,6.7809999999999997,385706.53,349,812723.75]
[3999,1,0,0,0,0,0,0,0,0,0,0,0,0,0,0,0,0,0,0,0,0,0]
[]
[null,null,null,null,null,null,null,null,null,null,null,null,null,null,null,null,null,null,null,{"$f":"AVERAGE(T4:T528)","v":13.039220952380944}]
[]
[null,null,null,null,null,null,null,null,null,null,null,null,null,null,null,null,null,null,null,{"$f":"SUM(T4:T528)","v":6845.5909999999958}]
[null,null,null,null,null,null,null,null,null,null,null,null,null,null,null,null,null,null,null,{"$f":"T532/T535","v":331}]
[null,null,null,null,null,null,null,null,null,null,null,null,null,null,null,null,null,null,null,{"$f":"T532/T533","v":20.681543806646513}]
[null,null,null,null,null,null,null,null,null,null,null,null,null,null,null,null,null,null,"Average NTC",{"$f":"AVERAGEIF(T4:T528,\">0\")","v":20.681543806646513}]

{"sheet":"Page 2 OPEB","index":19,"n_rows":528,"n_cols":15,"rows_kept":528,"cut":false,"hidden":true,"merged":[]}
[1,2,3,4,5,6,7,8,9,10,11,12,13,14,15]
[null,null,null,"21-9","22-9","23-9","24-9","25-9","26-9","21-10","22-10","23-10","24-10","25-10","26-10"]
["dst_num","dst_tye","dst_act_sts","peb_crt_tax_lvy","peb_cua_tax_adj","peb_fid_tax_adj","peb_adj_tax_lvy","peb_tax_mil_rat","peb_spd_tax_lvy","peb_crt_tax_lvy_2","peb_cua_tax_adj_2","peb_fid_tax_adj_2","peb_adj_tax_lvy_2","peb_tax_mil_rat_2","peb_spd_tax_lvy_2"]
[1,1,1,0,0,0,0,0,0,0,0,0,0,0,0]
[1.2,3,1,0,0,0,0,0,0,2371005,0,-264111.94,2106893.06,0.47799999999999998,2107652.52]
[2,1,1,0,0,0,0,0,0,0,0,0,0,0,0]
[4,1,1,0,0,0,0,0,0,152907.97,0,0,152907.97,1.806,152944.35999999999]
[6,3,1,0,0,0,0,0,0,721190,0,-176672,544518,4.4219999999999997,544548.68999999994]
[11,1,1,0,0,0,0,0,0,2146772.7799999998,0,-375919,1770853.78,0.95099999999999996,1771534.57]
[12,1,1,0,0,0,0,0,0,838330.41,0,-95651,742679.41,2.6190000000000002,742911.04]
[13,1,1,0,0,0,0,0,0,0,0,0,0,0,0]
[14,1,1,0,0,0,0,0,0,562042.88,0,-127748,434294.88,3.7970000000000002,434329.07]
[15,1,1,0,0,0,0,0,0,0,0,0,0,0,0]
[16,1,1,0,0,0,0,0,0,942659.21,0,-143139,799520.21,2.2959999999999998,799867.71]
[21,1,0,0,0,0,0,0,0,0,0,0,0,0,0]
[22,1,1,0,0,0,0,0,0,0,0,0,0,0,0]
[23,1,1,0,0,0,0,0,0,0,0,0,0,0,0]
[24,1,0,0,0,0,0,0,0,0,0,0,0,0,0]
[25,1,1,0,0,0,0,0,0,0,0,0,0,0,0]
[31,1,1,0,0,0,0,0,0,539726.97,0,0,539726.97,1.631,540754.93000000005]
[32,1,1,0,0,0,0,0,0,0,0,0,0,0,0]
[36,1,1,0,0,0,0,0,0,0,0,0,0,0,0]
[38,1,1,0,0,0,0,0,0,0,0,0,0,0,0]
[47,1,1,0,0,0,0,0,0,0,0,0,0,0,0]
[51,1,1,0,0,0,0,0,0,0,0,0,0,0,0]
[55,1,0,0,0,0,0,0,0,0,0,0,0,0,0]
[57,1,0,0,0,0,0,0,0,0,0,0,0,0,0]
[58,1,0,0,0,0,0,0,0,0,0,0,0,0,0]
[60,1,0,0,0,0,0,0,0,0,0,0,0,0,0]
[62,1,0,0,0,0,0,0,0,0,0,0,0,0,0]
[70,1,0,0,0,0,0,0,0,0,0,0,0,0,0]
[72,1,0,0,0,0,0,0,0,0,0,0,0,0,0]
[75,1,1,0,0,0,0,0,0,0,0,0,0,0,0]
[77,1,1,0,0,0,0,0,0,992019.62,0,0,992019.62,1.5229999999999999,991593.24]
[78,1,0,0,0,0,0,0,0,0,0,0,0,0,0]
[79,1,0,0,0,0,0,0,0,0,0,0,0,0,0]
[81,1,1,0,0,0,0,0,0,0,0,0,0,0,0]
[84,1,1,0,0,0,0,0,0,0,0,0,0,0,0]
[85,1,1,0,0,0,0,0,0,0,0,0,0,0,0]
[88,1,1,0,0,0,0,0,0,0,0,0,0,0,0]
[91,1,1,0,0,0,0,0,0,0,0,0,0,0,0]
[93,1,1,0,0,0,0,0,0,225307.58,0,0,225307.58,4.8179999999999996,225327.65]
[94,1,1,0,0,0,0,0,0,469281.96,0,0,469281.96,4.5410000000000004,469302.59]
[95,1,1,0,0,0,0,0,0,0,0,0,0,0,0]
[97,1,1,0,0,0,0,0,0,0,0,0,0,0,0]
[99,1,1,0,0,0,0,0,0,1110996.22,0,0,1110996.22,21.103000000000002,1111015.1299999999]
[100,1,1,0,0,0,0,0,0,0,0,0,0,0,0]
[108,1,1,0,0,0,0,0,0,0,0,0,0,0,0]
[110,1,1,0,0,0,0,0,0,345500,0,-32381,313119,1.3160000000000001,313119]
[111,1,1,0,0,0,0,0,0,0,0,0,0,0,0]
[112,1,1,0,0,0,0,0,0,0,0,0,0,0,0]
[113,1,1,0,0,0,0,0,0,0,0,0,0,0,0]
[114,1,0,0,0,0,0,0,0,0,0,0,0,0,0]
[115,1,1,0,0,0,0,0,0,0,0,0,0,0,0]
[116,1,1,0,0,0,0,0,0,206654.86,0,0,206654.86,2.0699999999999998,206672.44]
[117,1,0,0,0,0,0,0,0,0,0,0,0,0,0]
[118,1,1,0,0,0,0,0,0,0,0,0,0,0,0]
[119,1,0,0,0,0,0,0,0,0,0,0,0,0,0]
[126,1,0,0,0,0,0,0,0,0,0,0,0,0,0]
[127,1,0,0,0,0,0,0,0,0,0,0,0,0,0]
[128,1,0,0,0,0,0,0,0,0,0,0,0,0,0]
[129,1,1,0,0,0,0,0,0,0,0,0,0,0,0]
[138,1,1,0,0,0,0,0,0,418826.11,0,0,418826.11,2.544,418826]
[139,1,1,0,0,0,0,0,0,0,0,0,0,0,0]
[140,1,0,0,0,0,0,0,0,0,0,0,0,0,0]
[141,1,0,0,0,0,0,0,0,0,0,0,0,0,0]
[145,1,0,0,0,0,0,0,0,0,0,0,0,0,0]
[146,1,1,0,0,0,0,0,0,0,0,0,0,0,0]
[147,1,0,0,0,0,0,0,0,0,0,0,0,0,0]
[150,1,1,0,0,0,0,0,0,0,0,0,0,0,0]
[152,1,1,0,0,0,0,0,0,1502945.53,0,0,1502945.53,3.8439999999999999,1502946]
[158,1,0,0,0,0,0,0,0,0,0,0,0,0,0]
[161,1,0,0,0,0,0,0,0,0,0,0,0,0,0]
[162,1,1,0,0,0,0,0,0,0,0,0,0,0,0]
[166,1,1,0,0,0,0,0,0,0,0,0,0,0,0]
[173,1,1,0,0,0,0,0,0,0,0,0,0,0,0]
[175,1,0,0,0,0,0,0,0,0,0,0,0,0,0]
[177,1,1,0,0,0,0,0,0,0,0,0,0,0,0]
[178,1,0,0,0,0,0,0,0,0,0,0,0,0,0]
[181,1,1,0,0,0,0,0,0,2653575.17,0,0,2653575.17,4.7309999999999999,2653671.17]
[182,1,1,0,0,0,0,0,0,678808.57,0,-22391.34,656417.23,3.4510000000000001,656561.38]
[186,1,1,0,0,0,0,0,0,0,0,0,0,0,0]
[191,1,1,0,0,0,0,0,0,1381586,0,-173405,1208181,1.8560000000000001,1208445.83]
[192,1,1,0,0,0,0,0,0,903653,0,-130891,772762,2.6709999999999998,772820.78]
[194,1,1,0,0,0,0,0,0,0,0,0,0,0,0]
[195,1,1,0,0,0,0,0,0,0,0,0,0,0,0]
[196,1,1,0,0,0,0,0,0,10003948,0,-1144948,8859000,5.69,8859313.7300000004]
[197,1,1,0,0,0,0,0,0,3364878,0,-289516,3075362,5.3330000000000002,3075511.08]
[199,1,1,0,0,0,0,0,0,756293,0,-94134,662159,2.5579999999999998,662088.11]
[200,1,1,0,0,0,0,0,0,0,0,0,0,0,0]
[201,1,0,0,0,0,0,0,0,0,0,0,0,0,0]
[202,1,0,0,0,0,0,0,0,0,0,0,0,0,0]
[203,1,1,0,0,0,0,0,0,0,0,0,0,0,0]
[204,1,1,0,0,0,0,0,0,0,0,0,0,0,0]
[205,1,0,0,0,0,0,0,0,0,0,0,0,0,0]
[206,1,1,0,0,0,0,0,0,749653,0,0,749653,1.71,749957.73]
[207,1,0,0,0,0,0,0,0,0,0,0,0,0,0]
[208,1,0,0,0,0,0,0,0,0,0,0,0,0,0]
[209,1,0,0,0,0,0,0,0,0,0,0,0,0,0]
[213,1,1,0,0,0,0,0,0,83660.22,0,0,83660.22,1.8089999999999999,83670.27]
[217,1,0,0,0,0,0,0,0,0,0,0,0,0,0]
[218,1,0,0,0,0,0,0,0,0,0,0,0,0,0]
[219,1,0,0,0,0,0,0,0,0,0,0,0,0,0]
[222,1,0,0,0,0,0,0,0,0,0,0,0,0,0]
[223,1,0,0,0,0,0,0,0,0,0,0,0,0,0]
[224,1,0,0,0,0,0,0,0,0,0,0,0,0,0]
[225,1,0,0,0,0,0,0,0,0,0,0,0,0,0]
[227,1,1,0,0,0,0,0,0,0,0,0,0,0,0]
[228,1,0,0,0,0,0,0,0,0,0,0,0,0,0]
[229,1,1,0,0,0,0,0,0,0,0,0,0,0,0]
[232,1,0,0,0,0,0,0,0,0,0,0,0,0,0]
[233,1,0,0,0,0,0,0,0,0,0,0,0,0,0]
[234,1,0,0,0,0,0,0,0,0,0,0,0,0,0]
[236,1,0,0,0,0,0,0,0,0,0,0,0,0,0]
[237,1,0,0,0,0,0,0,0,0,0,0,0,0,0]
[238,1,1,0,0,0,0,0,0,0,0,0,0,0,0]
[239,1,1,0,0,0,0,0,0,0,0,0,0,0,0]
[240,1,0,0,0,0,0,0,0,0,0,0,0,0,0]
[241,1,1,0,0,0,0,0,0,300478.52,0,0,300478.52,1.544,300555.96999999997]
[242,1,1,0,0,0,0,0,0,0,0,0,0,0,0]
[243,1,0,0,0,0,0,0,0,0,0,0,0,0,0]
[244,1,0,0,0,0,0,0,0,0,0,0,0,0,0]
[245,1,0,0,0,0,0,0,0,0,0,0,0,0,0]
[252,1,1,0,0,0,0,0,0,127077.24,-0.24,-128.88,126948.12,1.2290000000000001,126952.2]
[253,1,1,0,0,0,0,0,0,0,0,0,0,0,0]
[254,1,0,0,0,0,0,0,0,0,0,0,0,0,0]
[255,1,1,0,0,0,0,0,0,0,0,0,0,0,0]
[256,1,1,0,0,0,0,0,0,1844044.91,0.09,0,1844045,5.0110000000000001,1843927.69]
[258,1,0,0,0,0,0,0,0,0,0,0,0,0,0]
[260,1,0,0,0,0,0,0,0,0,0,0,0,0,0]
[261,1,1,0,0,0,0,0,0,0,0,0,0,0,0]
[262,1,0,0,0,0,0,0,0,0,0,0,0,0,0]
[263,1,0,0,0,0,0,0,0,0,0,0,0,0,0]
[264,1,1,0,0,0,0,0,0,0,0,0,0,0,0]
[265,1,0,0,0,0,0,0,0,0,0,0,0,0,0]
[270,1,1,0,0,0,0,0,0,4674824.6500000004,0,-283504.01,4391320.6399999997,4.0780000000000003,4391931.62]
[271,1,1,0,0,0,0,0,0,829121.09,0,-57769.81,771351.28,0.61399999999999999,772029.88]
[272,1,1,0,0,0,0,0,0,4029073.13,0,-195569.21,3833503.92,3.9910000000000001,3834141.61]
[273,1,1,0,0,0,0,0,0,0,0,0,0,0,0]
[276,1,1,0,0,0,0,0,0,1694871.91,0,-54740.21,1640131.7,1.8939999999999999,1640399.33]
[277,1,1,0,0,0,0,0,0,554736.13,0,-20153.75,534582.38,1.4630000000000001,534741.73]
[278,1,1,0,0,0,0,0,0,427638.81,0,-8931.9599999999991,418706.85,1.111,419042.25]
[279,1,1,0,0,0,0,0,0,2981664.94,0,-347734.22,2633930.7200000002,1.78,2634498.4]
[280,1,1,0,0,0,0,0,0,1015975.7,0,-146840.35999999999,869135.34,2.1709999999999998,869190.98]
[281,1,1,0,0,0,0,0,0,1912681.63,0,-328684.73,1583996.9,1.8859999999999999,1584568.3]
[282,1,1,0,0,0,0,0,0,0,0,0,0,0,0]
[283,1,1,0,0,0,0,0,0,795018.28,0,-67025.83,727992.45,1.274,728240.22]
[284,1,1,0,0,0,0,0,0,0,0,0,0,0,0]
[286,1,1,0,0,0,0,0,0,336540.84,0,-114306.22,222234.62,4.2699999999999996,222257.6]
[287,6,0,0,0,0,0,0,0,0,0,0,0,0,0]
[288,6,0,0,0,0,0,0,0,0,0,0,0,0,0]
[294,1,1,0,0,0,0,0,0,0,0,0,0,0,0]
[297,1,1,0,0,0,0,0,0,0,0,0,0,0,0]
[299,1,1,0,0,0,0,0,0,0,0,0,0,0,0]
[300,1,1,0,0,0,0,0,0,160289,0,0,160289,2.2250000000000001,160267.46]
[301,1,0,0,0,0,0,0,0,0,0,0,0,0,0]
[306,1,1,0,0,0,0,0,0,0,0,0,0,0,0]
[308,1,1,0,0,0,0,0,0,0,0,0,0,0,0]
[309,1,1,0,0,0,0,0,0,0,0,0,0,0,0]
[314,1,1,0,0,0,0,0,0,151003,0,0,151003,3.69,151003]
[316,1,1,0,0,0,0,0,0,1604131.33,0,-143039.4,1461091.93,22.797999999999998,1461086.66]
[317,1,1,0,0,0,0,0,0,177279.9,0,0,177279.9,2.121,177279.65]
[318,1,1,0,0,0,0,0,0,4149004.19,0,-107828.92,4041175.27,9.5640000000000001,4041218.08]
[319,1,1,0,0,0,0,0,0,324151.67,0,-19494.599999999999,304657.07,8.7829999999999995,304662.68]
[323,2,1,0,0,0,0,0,0,0,0,0,0,0,0]
[324,1,0,0,0,0,0,0,0,0,0,0,0,0,0]
[325,1,0,0,0,0,0,0,0,0,0,0,0,0,0]
[328,1,0,0,0,0,0,0,0,0,0,0,0,0,0]
[330,1,1,0,0,0,0,0,0,0,0,0,0,0,0]
[332,1,1,0,0,0,0,0,0,0,0,0,0,0,0]
[333,1,1,0,0,0,0,0,0,140680.17000000001,0,0,140680.17000000001,6.4989999999999997,140687.1]
[341,1,0,0,0,0,0,0,0,0,0,0,0,0,0]
[345,1,1,0,0,0,0,0,0,246645.96,0,0,246645.96,1.78,246678.01]
[346,1,0,0,0,0,0,0,0,0,0,0,0,0,0]
[347,1,1,0,0,0,0,0,0,0,0,0,0,0,0]
[351,1,0,0,0,0,0,0,0,0,0,0,0,0,0]
[352,1,0,0,0,0,0,0,0,0,0,0,0,0,0]
[353,1,0,0,0,0,0,0,0,0,0,0,0,0,0]
[354,1,0,0,0,0,0,0,0,0,0,0,0,0,0]
[356,1,1,0,0,0,0,0,0,0,0,0,0,0,0]
[361,1,1,0,0,0,0,0,0,0,0,0,0,0,0]
[362,1,1,0,0,0,0,0,0,0,0,0,0,0,0]
[363,1,1,0,0,0,0,0,0,0,0,0,0,0,0]
[371,1,0,0,0,0,0,0,0,0,0,0,0,0,0]
[376,1,0,0,0,0,0,0,0,0,0,0,0,0,0]
[377,1,0,0,0,0,0,0,0,0,0,0,0,0,0]
[378,1,1,0,0,0,0,0,0,0,0,0,0,0,0]
[381,1,1,0,0,0,0,0,0,818213.66,0,-28721.07,789492.59,3.7280000000000002,788379.43]
[390,1,1,0,0,0,0,0,0,0,0,0,0,0,0]
[391,1,1,0,0,0,0,0,0,0,0,0,0,0,0]
[392,1,0,0,0,0,0,0,0,0,0,0,0,0,0]
[393,1,0,0,0,0,0,0,0,0,0,0,0,0,0]
[394,1,0,0,0,0,0,0,0,0,0,0,0,0,0]
[395,1,0,0,0,0,0,0,0,0,0,0,0,0,0]
[402,1,1,0,0,0,0,0,0,0,0,0,0,0,0]
[403,1,1,0,0,0,0,0,0,0,0,0,0,0,0]
[404,1,1,0,0,0,0,0,0,0,0,0,0,0,0]
[408,1,0,0,0,0,0,0,0,0,0,0,0,0,0]
[409,1,0,0,0,0,0,0,0,0,0,0,0,0,0]
[411,1,0,0,0,0,0,0,0,0,0,0,0,0,0]
[412,1,0,0,0,0,0,0,0,0,0,0,0,0,0]
[413,1,1,0,0,0,0,0,0,131358,0,0,131358,0.70899999999999996,131398.56]
[414,1,1,0,0,0,0,0,0,0,0,0,0,0,0]
[415,1,1,0,0,0,0,0,0,0,0,0,0,0,0]
[417,1,0,0,0,0,0,0,0,0,0,0,0,0,0]
[418,1,0,0,0,0,0,0,0,0,0,0,0,0,0]
[421,1,0,0,0,0,0,0,0,0,0,0,0,0,0]
[422,1,0,0,0,0,0,0,0,0,0,0,0,0,0]
[423,1,1,0,0,0,0,0,0,0,0,0,0,0,0]
[424,1,1,0,0,0,0,0,0,0,0,0,0,0,0]
[425,1,0,0,0,0,0,0,0,0,0,0,0,0,0]
[426,1,0,0,0,0,0,0,0,0,0,0,0,0,0]
[427,1,0,0,0,0,0,0,0,0,0,0,0,0,0]
[432,1,1,0,0,0,0,0,0,0,0,0,0,0,0]
[435,1,1,0,0,0,0,0,0,0,0,0,0,0,0]
[436,1,0,0,0,0,0,0,0,0,0,0,0,0,0]
[437,1,0,0,0,0,0,0,0,0,0,0,0,0,0]
[440,1,0,0,0,0,0,0,0,0,0,0,0,0,0]
[441,1,1,0,0,0,0,0,0,0,0,0,0,0,0]
[442,1,0,0,0,0,0,0,0,0,0,0,0,0,0]
[443,1,0,0,0,0,0,0,0,0,0,0,0,0,0]
[444,1,0,0,0,0,0,0,0,0,0,0,0,0,0]
[446,1,0,0,0,0,0,0,0,0,0,0,0,0,0]
[447,1,1,0,0,0,0,0,0,0,0,0,0,0,0]
[451,1,0,0,0,0,0,0,0,0,0,0,0,0,0]
[453,1,0,0,0,0,0,0,0,0,0,0,0,0,0]
[454,1,0,0,0,0,0,0,0,0,0,0,0,0,0]
[456,1,0,0,0,0,0,0,0,0,0,0,0,0,0]
[457,1,0,0,0,0,0,0,0,0,0,0,0,0,0]
[458,1,1,0,0,0,0,0,0,0,0,0,0,0,0]
[459,1,0,0,0,0,0,0,0,0,0,0,0,0,0]
[460,1,0,0,0,0,0,0,0,0,0,0,0,0,0]
[461,1,0,0,0,0,0,0,0,0,0,0,0,0,0]
[463,1,1,0,0,0,0,0,0,0,0,0,0,0,0]
[464,1,0,0,0,0,0,0,0,0,0,0,0,0,0]
[465,1,1,0,0,0,0,0,0,0,0,0,0,0,0]
[466,1,1,0,0,0,0,0,0,0,0,0,0,0,0]
[473,1,1,0,0,0,0,0,0,0,0,0,0,0,0]
[477,1,1,0,0,0,0,0,0,0,0,0,0,0,0]
[480,1,1,0,0,0,0,0,0,0,0,0,0,0,0]
[482,1,1,0,0,0,0,0,0,0,0,0,0,0,0]
[483,1,0,0,0,0,0,0,0,0,0,0,0,0,0]
[484,1,1,0,0,0,0,0,0,0,0,0,0,0,0]
[485,1,1,0,0,0,0,0,0,0,0,0,0,0,0]
[486,1,1,0,0,0,0,0,0,0,0,0,0,0,0]
[487,1,1,0,0,0,0,0,0,0,0,0,0,0,0]
[492,1,1,0,0,0,0,0,0,0,0,0,0,0,0]
[495,1,1,0,0,0,0,0,0,0,0,0,0,0,0]
[497,1,1,0,0,0,0,0,0,0,0,0,0,0,0]
[499,1,1,0,0,0,0,0,0,106217.26,0,0,106217.26,2.1859999999999999,106213.19]
[500,1,1,0,0,0,0,0,0,0,0,0,0,0,0]
[504,1,0,0,0,0,0,0,0,0,0,0,0,0,0]
[505,1,1,0,0,0,0,0,0,0,0,0,0,0,0]
[507,1,1,0,0,0,0,0,0,0,0,0,0,0,0]
[508,1,1,0,0,0,0,0,0,0,0,0,0,0,0]
[511,1,1,0,0,0,0,0,0,0,0,0,0,0,0]
[513,1,0,0,0,0,0,0,0,0,0,0,0,0,0]
[514,1,1,0,0,0,0,0,0,0,0,0,0,0,0]
[516,1,0,0,0,0,0,0,0,0,0,0,0,0,0]
[518,1,1,0,0,0,0,0,0,0,0,0,0,0,0]
[521,1,0,0,0,0,0,0,0,0,0,0,0,0,0]
[522,1,0,0,0,0,0,0,0,0,0,0,0,0,0]
[523,1,0,0,0,0,0,0,0,0,0,0,0,0,0]
[524,1,0,0,0,0,0,0,0,0,0,0,0,0,0]
[525,1,0,0,0,0,0,0,0,0,0,0,0,0,0]
[526,1,0,0,0,0,0,0,0,0,0,0,0,0,0]
[531,1,1,0,0,0,0,0,0,0,0,0,0,0,0]
[533,1,1,0,0,0,0,0,0,0,0,0,0,0,0]
[534,1,1,0,0,0,0,0,0,0,0,0,0,0,0]
[535,1,1,0,0,0,0,0,0,0,0,0,0,0,0]
[542,1,1,0,0,0,0,0,0,0,0,0,0,0,0]
[543,1,0,0,0,0,0,0,0,0,0,0,0,0,0]
[544,1,1,0,0,0,0,0,0,0,0,0,0,0,0]
[545,1,1,0,0,0,0,0,0,0,0,0,0,0,0]
[547,1,1,0,0,0,0,0,0,0,0,0,0,0,0]
[548,1,1,0,0,0,0,0,0,137505.91,0,0,137505.91,0.81899999999999995,137561.97]
[549,1,1,0,0,0,0,0,0,0,0,0,0,0,0]
[550,1,1,0,0,0,0,0,0,0,0,0,0,0,0]
[553,1,1,0,0,0,0,0,0,0,0,0,0,0,0]
[561,1,1,0,0,0,0,0,0,0,0,0,0,0,0]
[564,1,1,0,0,0,0,0,0,233479.77,0,0,233479.77,1.7849999999999999,233416.31]
[566,1,0,0,0,0,0,0,0,0,0,0,0,0,0]
[570,1,0,0,0,0,0,0,0,0,0,0,0,0,0]
[573,1,0,0,0,0,0,0,0,0,0,0,0,0,0]
[576,1,0,0,0,0,0,0,0,0,0,0,0,0,0]
[577,1,1,0,0,0,0,0,0,0,0,0,0,0,0]
[578,1,1,0,0,0,0,0,0,0,0,0,0,0,0]
[581,1,1,0,0,0,0,0,0,0,0,0,0,0,0]
[582,1,0,0,0,0,0,0,0,0,0,0,0,0,0]
[583,1,0,0,0,0,0,0,0,0,0,0,0,0,0]
[584,1,0,0,0,0,0,0,0,0,0,0,0,0,0]
[592,1,1,0,0,0,0,0,0,0,0,0,0,0,0]
[593,1,1,0,0,0,0,0,0,0,0,0,0,0,0]
[595,1,1,0,0,0,0,0,0,0,0,0,0,0,0]
[597,1,0,0,0,0,0,0,0,0,0,0,0,0,0]
[599,1,1,0,0,0,0,0,0,0,0,0,0,0,0]
[600,1,1,0,0,0,0,0,0,0,0,0,0,0,0]
[601,1,1,0,0,0,0,0,0,0,0,0,0,0,0]
[603,1,0,0,0,0,0,0,0,0,0,0,0,0,0]
[604,1,0,0,0,0,0,0,0,0,0,0,0,0,0]
[611,1,0,0,0,0,0,0,0,0,0,0,0,0,0]
[612,1,0,0,0,0,0,0,0,0,0,0,0,0,0]
[614,1,0,0,0,0,0,0,0,0,0,0,0,0,0]
[615,1,0,0,0,0,0,0,0,0,0,0,0,0,0]
[621,1,1,0,0,0,0,0,0,2587696,0,-279128,2308568,2.6890000000000001,2308567.9900000002]
[622,1,1,0,0,0,0,0,0,2695728,0,-423547,2272181,3.036,2272180.63]
[623,1,1,0,0,0,0,0,0,1409274,0,-171637,1237637,2.105,1237637.02]
[624,1,1,0,0,0,0,0,0,6384087,0,-713756,5670331,8.1720000000000006,5670331.0800000001]
[625,1,1,0,0,0,0,0,0,0,0,0,0,0,0]
[627,1,0,0,0,0,0,0,0,0,0,0,0,0,0]
[628,1,0,0,0,0,0,0,0,0,0,0,0,0,0]
[630,1,1,0,0,0,0,0,0,0,0,0,0,0,0]
[631,1,0,0,0,0,0,0,0,0,0,0,0,0,0]
[633,1,0,0,0,0,0,0,0,0,0,0,0,0,0]
[635,1,1,0,0,0,0,0,0,0,0,0,0,0,0]
[636,1,0,0,0,0,0,0,0,0,0,0,0,0,0]
[637,1,0,0,0,0,0,0,0,0,0,0,0,0,0]
[638,1,0,0,0,0,0,0,0,0,0,0,0,0,0]
[640,1,1,0,0,0,0,0,0,0,0,0,0,0,0]
[641,1,0,0,0,0,0,0,0,0,0,0,0,0,0]
[646,1,0,0,0,0,0,0,0,0,0,0,0,0,0]
[647,1,0,0,0,0,0,0,0,0,0,0,0,0,0]
[648,1,0,0,0,0,0,0,0,0,0,0,0,0,0]
[649,1,0,0,0,0,0,0,0,0,0,0,0,0,0]
[650,1,0,0,0,0,0,0,0,0,0,0,0,0,0]
[651,1,0,0,0,0,0,0,0,0,0,0,0,0,0]
[652,1,0,0,0,0,0,0,0,0,0,0,0,0,0]
[653,1,0,0,0,0,0,0,0,0,0,0,0,0,0]
[654,1,0,0,0,0,0,0,0,0,0,0,0,0,0]
[655,1,0,0,0,0,0,0,0,0,0,0,0,0,0]
[656,1,1,0,0,0,0,0,0,0,0,0,0,0,0]
[657,1,0,0,0,0,0,0,0,0,0,0,0,0,0]
[659,1,1,0,0,0,0,0,0,0,0,0,0,0,0]
[669,1,0,0,0,0,0,0,0,0,0,0,0,0,0]
[670,1,0,0,0,0,0,0,0,0,0,0,0,0,0]
[671,1,1,0,0,0,0,0,0,0,0,0,0,0,0]
[676,1,1,0,0,0,0,0,0,0,0,0,0,0,0]
[678,1,0,0,0,0,0,0,0,0,0,0,0,0,0]
[682,1,1,0,0,0,0,0,0,0,0,0,0,0,0]
[690,1,1,0,0,0,0,0,0,980812,0,0,980812,20.451000000000001,980803.37]
[691,1,0,0,0,0,0,0,0,0,0,0,0,0,0]
[692,1,0,0,0,0,0,0,0,0,0,0,0,0,0]
[693,1,0,0,0,0,0,0,0,0,0,0,0,0,0]
[695,1,1,0,0,0,0,0,0,530554.99,0,-236917.48,293637.51,15.874000000000001,293641.86]
[696,1,1,0,0,0,0,0,0,0,0,0,0,0,0]
[697,1,0,0,0,0,0,0,0,0,0,0,0,0,0]
[698,1,1,0,0,0,0,0,0,0,0,0,0,0,0]
[699,1,0,0,0,0,0,0,0,0,0,0,0,0,0]
[700,1,1,0,0,0,0,0,0,0,0,0,0,0,0]
[701,1,1,0,0,0,0,0,0,0,0,0,0,0,0]
[704,1,1,0,0,0,0,0,0,441818.23,0,0,441818.23,4.0069999999999997,441821.8]
[706,1,1,0,0,0,0,0,0,703148.06,0,-198156.35,504991.71,9.7799999999999994,505000.57]
[707,1,1,0,0,0,0,0,0,0,0,0,0,0,0]
[708,1,0,0,0,0,0,0,0,0,0,0,0,0,0]
[709,1,1,0,0,0,0,0,0,0,0,0,0,0,0]
[710,1,0,0,0,0,0,0,0,0,0,0,0,0,0]
[712,1,1,0,0,0,0,0,0,0,0,0,0,0,0]
[716,1,1,0,0,0,0,0,0,0,0,0,0,0,0]
[717,1,1,0,0,0,0,0,0,0,0,0,0,0,0]
[719,1,1,0,0,0,0,0,0,0,0,0,0,0,0]
[720,1,1,0,0,0,0,0,0,0,0,0,0,0,0]
[721,1,1,0,0,0,0,0,0,0,0,0,0,0,0]
[726,1,1,0,0,0,0,0,0,0,0,0,0,0,0]
[727,1,1,0,0,0,0,0,0,389880.75,0,0,389880.75,2.8809999999999998,389895.21]
[728,1,1,0,0,0,0,0,0,304898.44,0,-7982.02,296916.42,0.41199999999999998,296988.90999999997]
[731,1,0,0,0,0,0,0,0,0,0,0,0,0,0]
[732,1,0,0,0,0,0,0,0,0,0,0,0,0,0]
[733,1,0,0,0,0,0,0,0,0,0,0,0,0,0]
[734,1,0,0,0,0,0,0,0,0,0,0,0,0,0]
[735,1,0,0,0,0,0,0,0,0,0,0,0,0,0]
[736,1,0,0,0,0,0,0,0,0,0,0,0,0,0]
[737,1,0,0,0,0,0,0,0,0,0,0,0,0,0]
[738,1,1,0,0,0,0,0,0,331841,0,0,331841,7.7809999999999997,331841]
[739,1,1,0,0,0,0,0,0,0,0,0,0,0,0]
[740,1,1,0,0,0,0,0,0,0,0,0,0,0,0]
[741,1,1,0,0,0,0,0,0,0,0,0,0,0,0]
[742,1,1,0,0,0,0,0,0,0,0,0,0,0,0]
[743,1,1,0,0,0,0,0,0,0,0,0,0,0,0]
[745,1,1,0,0,0,0,0,0,0,0,0,0,0,0]
[748,1,1,0,0,0,0,0,0,0,0,0,0,0,0]
[750,1,1,0,0,0,0,0,0,328693,0,0,328693,2.4140000000000001,328693]
[756,1,1,0,0,0,0,0,0,0,0,0,0,0,0]
[761,1,1,0,0,0,0,0,0,0,0,0,0,0,0]
[762,1,0,0,0,0,0,0,0,0,0,0,0,0,0]
[763,1,1,0,0,0,0,0,0,0,0,0,0,0,0]
[768,1,1,0,0,0,0,0,0,0,0,0,0,0,0]
[769,1,0,0,0,0,0,0,0,0,0,0,0,0,0]
[771,1,1,0,0,0,0,0,0,0,0,0,0,0,0]
[775,1,1,0,0,0,0,0,0,0,0,0,0,0,0]
[777,1,1,0,0,0,0,0,0,0,0,0,0,0,0]
[784,1,0,0,0,0,0,0,0,0,0,0,0,0,0]
[786,1,1,0,0,0,0,0,0,0,0,0,0,0,0]
[787,1,1,0,0,0,0,0,0,0,0,0,0,0,0]
[789,1,0,0,0,0,0,0,0,0,0,0,0,0,0]
[790,1,0,0,0,0,0,0,0,0,0,0,0,0,0]
[791,1,0,0,0,0,0,0,0,0,0,0,0,0,0]
[792,1,0,0,0,0,0,0,0,0,0,0,0,0,0]
[793,1,0,0,0,0,0,0,0,0,0,0,0,0,0]
[801,1,1,0,0,0,0,0,0,0,0,0,0,0,0]
[803,1,1,0,0,0,0,0,0,0,0,0,0,0,0]
[806,1,0,0,0,0,0,0,0,0,0,0,0,0,0]
[809,1,0,0,0,0,0,0,0,0,0,0,0,0,0]
[810,1,0,0,0,0,0,0,0,0,0,0,0,0,0]
[811,1,1,0,0,0,0,0,0,0,0,0,0,0,0]
[813,1,1,0,0,0,0,0,0,0,0,0,0,0,0]
[815,2,1,0,0,0,0,0,0,0,0,0,0,0,0]
[818,1,1,0,0,0,0,0,0,0,0,0,0,0,0]
[819,1,0,0,0,0,0,0,0,0,0,0,0,0,0]
[820,1,1,0,0,0,0,0,0,0,0,0,0,0,0]
[821,1,1,0,0,0,0,0,0,0,0,0,0,0,0]
[827,1,0,0,0,0,0,0,0,0,0,0,0,0,0]
[829,1,1,0,0,0,0,0,0,0,0,0,0,0,0]
[830,1,0,0,0,0,0,0,0,0,0,0,0,0,0]
[831,1,1,0,0,0,0,0,0,531772,0,-42261,489511,1.006,489511]
[832,1,1,0,0,0,0,0,0,328551,0,-19165,309386,1.413,309386]
[833,1,1,0,0,0,0,0,0,0,0,0,0,0,0]
[834,1,1,0,0,0,0,0,0,5215360,0,-340971,4874389,5.4660000000000002,4874389]
[836,1,1,0,0,0,0,0,0,0,0,0,0,0,0]
[837,1,1,0,0,0,0,0,0,0,0,0,0,0,0]
[840,1,1,0,0,0,0,0,0,0,0,0,0,0,0]
[846,1,1,0,0,0,0,0,0,0,0,0,0,0,0]
[850,1,1,0,0,0,0,0,0,0,0,0,0,0,0]
[852,1,1,0,0,0,0,0,0,0,0,0,0,0,0]
[857,1,1,0,0,0,0,0,0,0,0,0,0,0,0]
[858,1,1,0,0,0,0,0,0,0,0,0,0,0,0]
[861,1,1,0,0,0,0,0,0,337973.6,0,0,337973.6,1.111,338075.61]
[876,1,1,0,0,0,0,0,0,0,0,0,0,0,0]
[877,1,1,0,0,0,0,0,0,1272597,0,-16254,1256343,3.9929999999999999,1256491.05]
[879,1,1,0,0,0,0,0,0,0,0,0,0,0,0]
[880,1,0,0,0,0,0,0,0,0,0,0,0,0,0]
[881,1,1,0,0,0,0,0,0,85225,0,0,85225,1.472,85202.54]
[882,1,1,0,0,0,0,0,0,0,0,0,0,0,0]
[883,1,1,0,0,0,0,0,0,0,0,0,0,0,0]
[885,1,1,0,0,0,0,0,0,0,0,0,0,0,0]
[891,1,1,0,0,0,0,0,0,0,0,0,0,0,0]
[892,1,0,0,0,0,0,0,0,0,0,0,0,0,0]
[893,1,0,0,0,0,0,0,0,0,0,0,0,0,0]
[894,1,0,0,0,0,0,0,0,0,0,0,0,0,0]
[896,1,0,0,0,0,0,0,0,0,0,0,0,0,0]
[911,1,1,0,0,0,0,0,0,0,0,0,0,0,0]
[912,1,1,0,0,0,0,0,0,315594,0,0,315594,4.3680000000000003,315636.44]
[913,1,0,0,0,0,0,0,0,0,0,0,0,0,0]
[914,1,1,0,0,0,0,0,0,0,0,0,0,0,0]
[916,6,0,0,0,0,0,0,0,0,0,0,0,0,0]
[917,6,0,0,0,0,0,0,0,0,0,0,0,0,0]
[918,1,0,0,0,0,0,0,0,0,0,0,0,0,0]
[2071,1,1,0,0,0,0,0,0,182991.38,0,0,182991.38,1.581,182996.36]
[2125,1,1,0,0,0,0,0,0,0,0,0,0,0,0]
[2134,1,1,0,0,0,0,0,0,169717.44,0,0,169717.44,1.2649999999999999,169654.91]
[2135,1,1,0,0,0,0,0,0,0,0,0,0,0,0]
[2137,1,1,0,0,0,0,0,0,88208.99,0,0,88208.99,1.304,88212.35]
[2142,1,1,0,0,0,0,0,0,0,0,0,0,0,0]
[2143,1,1,0,0,0,0,0,0,0,0,0,0,0,0]
[2144,1,1,0,0,0,0,0,0,0,0,0,0,0,0]
[2148,1,0,0,0,0,0,0,0,0,0,0,0,0,0]
[2149,1,1,0,0,0,0,0,0,492663,0,0,492663,3.198,492794.66]
[2153,1,0,0,0,0,0,0,0,0,0,0,0,0,0]
[2154,1,1,0,0,0,0,0,0,32642.14,0,-4980.41,27661.73,0.65400000000000003,27661.64]
[2155,1,1,0,0,0,0,0,0,0,0,0,0,0,0]
[2159,1,1,0,0,0,0,0,0,0,0,0,0,0,0]
[2163,1,0,0,0,0,0,0,0,0,0,0,0,0,0]
[2164,1,1,0,0,0,0,0,0,156390.89000000001,0,0,156390.89000000001,1.643,156391]
[2165,1,1,0,0,0,0,0,0,0,0,0,0,0,0]
[2167,1,1,0,0,0,0,0,0,0,0,0,0,0,0]
[2168,1,1,0,0,0,0,0,0,0,0,0,0,0,0]
[2169,1,1,0,0,0,0,0,0,0,0,0,0,0,0]
[2170,1,1,0,0,0,0,0,0,146059,0,0,146059,1.538,146059.12]
[2171,1,1,0,0,0,0,0,0,0,0,0,0,0,0]
[2172,1,1,0,0,0,0,0,0,0,0,0,0,0,0]
[2174,1,1,0,0,0,0,0,0,0,0,0,0,0,0]
[2176,1,1,0,0,0,0,0,0,0,0,0,0,0,0]
[2180,1,1,0,0,0,0,0,0,0,0,0,0,0,0]
[2183,1,0,0,0,0,0,0,0,0,0,0,0,0,0]
[2184,1,1,0,0,0,0,0,0,0,0,0,0,0,0]
[2190,1,1,0,0,0,0,0,0,191616.16,0,0,191616.16,1.167,191617.97]
[2198,1,1,0,0,0,0,0,0,109186.88,0,0,109186.88,1.4670000000000001,109163.61]
[2215,1,1,0,0,0,0,0,0,0,0,0,0,0,0]
[2310,1,1,0,0,0,0,0,0,0,0,0,0,0,0]
[2311,1,1,0,0,0,0,0,0,0,0,0,0,0,0]
[2342,1,1,0,0,0,0,0,0,0,0,0,0,0,0]
[2358,1,1,0,0,0,0,0,0,0,0,0,0,0,0]
[2359,1,0,0,0,0,0,0,0,0,0,0,0,0,0]
[2364,1,1,0,0,0,0,0,0,0,0,0,0,0,0]
[2365,1,1,0,0,0,0,0,0,109445.32,0,0,109445.32,0.65900000000000003,109380.48]
[2396,1,1,0,0,0,0,0,0,0,0,0,0,0,0]
[2397,1,1,0,0,0,0,0,0,0,0,0,0,0,0]
[2448,1,1,0,0,0,0,0,0,0,0,0,0,0,0]
[2527,1,1,0,0,0,0,0,0,0,0,0,0,0,0]
[2534,1,1,0,0,0,0,0,0,0,0,0,0,0,0]
[2536,1,1,0,0,0,0,0,0,0,0,0,0,0,0]
[2580,1,1,0,0,0,0,0,0,0,0,0,0,0,0]
[2609,1,1,0,0,0,0,0,0,0,0,0,0,0,0]
[2683,1,1,0,0,0,0,0,0,0,0,0,0,0,0]
[2687,1,1,0,0,0,0,0,0,0,0,0,0,0,0]
[2689,1,1,0,0,0,0,0,0,0,0,0,0,0,0]
[2711,1,1,0,0,0,0,0,0,1198341.79,0,-108648.21,1089693.58,17.710999999999999,1089676.8899999999]
[2752,1,1,0,0,0,0,0,0,0,0,0,0,0,0]
[2753,1,1,0,0,0,0,0,0,0,0,0,0,0,0]
[2754,1,1,0,0,0,0,0,0,0,0,0,0,0,0]
[2758,1,0,0,0,0,0,0,0,0,0,0,0,0,0]
[2759,1,1,0,0,0,0,0,0,0,0,0,0,0,0]
[2769,1,1,0,0,0,0,0,0,96152.69,0,0,96152.69,0.879,96200]
[2805,1,1,0,0,0,0,0,0,0,0,0,0,0,0]
[2835,1,1,0,0,0,0,0,0,0,0,0,0,0,0]
[2853,1,1,0,0,0,0,0,0,169193,0,0,169193,0.97099999999999997,169239.14]
[2854,1,1,0,0,0,0,0,0,0,0,0,0,0,0]
[2856,1,1,0,0,0,0,0,0,0,0,0,0,0,0]
[2859,1,1,0,0,0,0,0,0,0,0,0,0,0,0]
[2860,1,1,0,0,0,0,0,0,0,0,0,0,0,0]
[2862,1,0,0,0,0,0,0,0,0,0,0,0,0,0]
[2884,1,1,0,0,0,0,0,0,0,0,0,0,0,0]
[2886,1,1,0,0,0,0,0,0,0,0,0,0,0,0]
[2887,1,0,0,0,0,0,0,0,0,0,0,0,0,0]
[2888,1,1,0,0,0,0,0,0,0,0,0,0,0,0]
[2889,1,1,0,0,0,0,0,0,0,0,0,0,0,0]
[2890,1,1,0,0,0,0,0,0,0,0,0,0,0,0]
[2895,1,1,0,0,0,0,0,0,0,0,0,0,0,0]
[2897,1,1,0,0,0,0,0,0,0,0,0,0,0,0]
[2898,1,1,0,0,0,0,0,0,0,0,0,0,0,0]
[2899,1,1,0,0,0,0,0,0,0,0,0,0,0,0]
[2902,1,1,0,0,0,0,0,0,0,0,0,0,0,0]
[2903,1,1,0,0,0,0,0,0,0,0,0,0,0,0]
[2904,1,1,0,0,0,0,0,0,0,0,0,0,0,0]
[2905,1,1,0,0,0,0,0,0,0,0,0,0,0,0]
[2906,1,1,0,0,0,0,0,0,0,0,0,0,0,0]
[2907,1,1,0,0,0,0,0,0,0,0,0,0,0,0]
[2908,1,1,0,0,0,0,0,0,0,0,0,0,0,0]
[3999,1,0,0,0,0,0,0,0,0,0,0,0,0,0]

{"sheet":"Counties","index":20,"n_rows":333,"n_cols":10,"rows_kept":333,"cut":false,"hidden":true,"merged":[]}
["atv_sts","dat_yer","uni_maj","uni_tye","uni_nam","Proper","uni_imd","cou_num","ecu_rgn","cou_name"]
["A","15-16",1,1,"AITKIN PUBLIC SCHOOL DISTRICT",{"$f":"PROPER(E2)","v":"Aitkin Public School District"},0,1,3,"Aitkin Co"]
["A","15-16",2,1,"HILL CITY PUBLIC SCHOOL DISTRICT",{"$f":"PROPER(E3)","v":"Hill City Public School District"},0,1,3,"Aitkin Co"]
["A","15-16",4,1,"MCGREGOR PUBLIC SCHOOL DISTRICT","Mcgregor Public School District",0,1,3,"Aitkin Co"]
["A","15-16",11,1,"ANOKA-HENNEPIN PUBLIC SCHOOL DIST.","Anoka-Hennepin Public School Dist.",0,2,11,"Anoka Co"]
["A","15-16",12,1,"CENTENNIAL PUBLIC SCHOOL DISTRICT","Centennial Public School District",0,2,11,"Anoka Co"]
["A","15-16",13,1,"COLUMBIA HEIGHTS PUBLIC SCHOOL DIST","Columbia Heights Public School Dist",0,2,11,"Anoka Co"]
["A","15-16",14,1,"FRIDLEY PUBLIC SCHOOL DISTRICT","Fridley Public School District",0,2,11,"Anoka Co"]
["A","15-16",15,1,"ST. FRANCIS PUBLIC SCHOOL DISTRICT","St. Francis Public School District",0,2,11,"Anoka Co"]
["A","15-16",16,1,"SPRING LAKE PARK PUBLIC SCHOOLS","Spring Lake Park Public Schools",0,2,11,"Anoka Co"]
["A","15-16",22,1,"DETROIT LAKES PUBLIC SCHOOL DIST.","Detroit Lakes Public School Dist.",0,3,4,"Becker Co"]
["A","15-16",23,1,"FRAZEE-VERGAS PUBLIC SCHOOL DIST.","Frazee-Vergas Public School Dist.",0,3,4,"Becker Co"]
["A","15-16",25,1,"PINE POINT PUBLIC SCHOOL DISTRICT","Pine Point Public School District",0,3,1,"Becker Co"]
["A","15-16",2889,1,"LAKE PARK AUDUBON SCHOOL DISTRICT","Lake Park Audubon School District",0,3,4,"Becker Co"]
["A","15-16",31,1,"BEMIDJI PUBLIC SCHOOL DISTRICT","Bemidji Public School District",0,4,1,"Beltrami Co"]
["A","15-16",32,1,"BLACKDUCK PUBLIC SCHOOL DISTRICT","Blackduck Public School District",0,4,1,"Beltrami Co"]
["A","15-16",36,1,"KELLIHER PUBLIC SCHOOL DISTRICT","Kelliher Public School District",0,4,1,"Beltrami Co"]
["A","15-16",38,1,"RED LAKE PUBLIC SCHOOL DISTRICT","Red Lake Public School District",0,4,1,"Beltrami Co"]
["A","15-16",47,1,"SAUK RAPIDS-RICE PUBLIC SCHOOLS","Sauk Rapids-Rice Public Schools",0,5,7,"Benton Co"]
["A","15-16",51,1,"FOLEY PUBLIC SCHOOL DISTRICT","Foley Public School District",0,5,7,"Benton Co"]
["A","15-16",2888,1,"CLINTON-GRACEVILLE-BEARDSLEY","Clinton-Graceville-Beardsley",0,6,4,"Big Stone Co"]
["A","15-16",2903,1,"ORTONVILLE PUBLIC SCHOOLS","Ortonville Public Schools",0,6,6,"Big Stone Co"]
["A","15-16",75,1,"ST. CLAIR PUBLIC SCHOOL DISTRICT","St. Clair Public School District",0,7,9,"Blue Earth Co"]
["A","15-16",77,1,"MANKATO PUBLIC SCHOOL DISTRICT","Mankato Public School District",0,7,9,"Blue Earth Co"]
["A","15-16",2071,1,"LAKE CRYSTAL-WELLCOME MEMORIAL","Lake Crystal-Wellcome Memorial",0,7,9,"Blue Earth Co"]
["A","15-16",2135,1,"MAPLE RIVER SCHOOL DISTRICT","Maple River School District",0,7,9,"Blue Earth Co"]
["A","15-16",81,1,"COMFREY PUBLIC SCHOOL DISTRICT","Comfrey Public School District",0,8,9,"Brown Co"]
["A","15-16",84,1,"SLEEPY EYE PUBLIC SCHOOL DISTRICT","Sleepy Eye Public School District",0,8,9,"Brown Co"]
["A","15-16",85,1,"SPRINGFIELD PUBLIC SCHOOL DISTRICT","Springfield Public School District",0,8,9,"Brown Co"]
["A","15-16",88,1,"NEW ULM PUBLIC SCHOOL DISTRICT","New Ulm Public School District",0,8,9,"Brown Co"]
["A","15-16",91,1,"BARNUM PUBLIC SCHOOL DISTRICT","Barnum Public School District",0,9,3,"Carlton Co"]
["A","15-16",93,1,"CARLTON PUBLIC SCHOOL DISTRICT","Carlton Public School District",0,9,3,"Carlton Co"]
["A","15-16",94,1,"CLOQUET PUBLIC SCHOOL DISTRICT","Cloquet Public School District",0,9,3,"Carlton Co"]
["A","15-16",95,1,"CROMWELL-WRIGHT PUBLIC SCHOOLS","Cromwell-Wright Public Schools",0,9,3,"Carlton Co"]
["A","15-16",97,1,"MOOSE LAKE PUBLIC SCHOOL DISTRICT","Moose Lake Public School District",0,9,3,"Carlton Co"]
["A","15-16",99,1,"ESKO PUBLIC SCHOOL DISTRICT","Esko Public School District",0,9,3,"Carlton Co"]
["A","15-16",100,1,"WRENSHALL PUBLIC SCHOOL DISTRICT","Wrenshall Public School District",0,9,3,"Carlton Co"]
["A","15-16",108,1,"CENTRAL PUBLIC SCHOOL DISTRICT","Central Public School District",0,10,11,"Carver Co"]
["A","15-16",110,1,"WACONIA PUBLIC SCHOOL DISTRICT","Waconia Public School District",0,10,11,"Carver Co"]
["A","15-16",111,1,"WATERTOWN-MAYER PUBLIC SCHOOL DIST.","Watertown-Mayer Public School Dist.",0,10,11,"Carver Co"]
["A","15-16",112,1,"EASTERN CARVER COUNTY PUBLIC SCHOOL","Eastern Carver County Public School",0,10,11,"Carver Co"]
["A","15-16",113,1,"WALKER-HACKENSACK-AKELEY SCHL. DIST","Walker-Hackensack-Akeley Schl. Dist",0,11,5,"Cass Co"]
["A","15-16",115,1,"CASS LAKE-BENA PUBLIC SCHOOLS","Cass Lake-Bena Public Schools",0,11,5,"Cass Co"]
["A","15-16",116,1,"PILLAGER PUBLIC SCHOOL DISTRICT","Pillager Public School District",0,11,5,"Cass Co"]
["A","15-16",118,1,"NORTHLAND COMMUNITY SCHOOLS","Northland Community Schools",0,11,5,"Cass Co"]
["A","15-16",2174,1,"PINE RIVER-BACKUS SCHOOL DISTRICT","Pine River-Backus School District",0,11,5,"Cass Co"]
["A","15-16",129,1,"MONTEVIDEO PUBLIC SCHOOL DISTRICT","Montevideo Public School District",0,12,6,"Chippewa Co"]
["A","15-16",2180,1,"M.A.C.C.R.A.Y. SCHOOL DISTRICT","M.A.C.C.R.A.Y. School District",0,12,6,"Chippewa Co"]
["A","15-16",138,1,"NORTH BRANCH PUBLIC SCHOOLS","North Branch Public Schools",0,13,7,"Chisago Co"]
["A","15-16",139,1,"RUSH CITY PUBLIC SCHOOL DISTRICT","Rush City Public School District",0,13,7,"Chisago Co"]
["A","15-16",323,2,"FRANCONIA PUBLIC SCHOOL DISTRICT","Franconia Public School District",0,13,7,"Chisago Co"]
["A","15-16",2144,1,"CHISAGO LAKES SCHOOL DISTRICT","Chisago Lakes School District",0,13,7,"Chisago Co"]
["A","15-16",146,1,"BARNESVILLE PUBLIC SCHOOL DIST.","Barnesville Public School Dist.",0,14,4,"Clay Co"]
["A","15-16",150,1,"HAWLEY PUBLIC SCHOOL DISTRICT","Hawley Public School District",0,14,4,"Clay Co"]
["A","15-16",152,1,"MOORHEAD PUBLIC SCHOOL DISTRICT","Moorhead Public School District",0,14,4,"Clay Co"]
["A","15-16",914,1,"ULEN-HITTERDAL PUBLIC SCHOOL DIST","Ulen-Hitterdal Public School Dist",0,14,4,"Clay Co"]
["A","15-16",2164,1,"DILWORTH-GLYNDON-FELTON","Dilworth-Glyndon-Felton",0,14,4,"Clay Co"]
["A","15-16",162,1,"BAGLEY PUBLIC SCHOOL DISTRICT","Bagley Public School District",0,15,1,"Clearwater Co"]
["A","15-16",2311,1,"CLEARBROOK-GONVICK SCHOOL DISTRICT","Clearbrook-Gonvick School District",0,15,1,"Clearwater Co"]
["A","15-16",166,1,"COOK COUNTY PUBLIC SCHOOLS","Cook County Public Schools",0,16,3,"Cook Co"]
["A","15-16",173,1,"MOUNTAIN LAKE PUBLIC SCHOOLS","Mountain Lake Public Schools",0,17,6,"Cottonwood Co"]
["A","15-16",177,1,"WINDOM PUBLIC SCHOOL DISTRICT","Windom Public School District",0,17,6,"Cottonwood Co"]
["A","15-16",2884,1,"RED ROCK CENTRAL SCHOOL DISTRICT","Red Rock Central School District",0,17,6,"Cottonwood Co"]
["A","15-16",2898,1,"WESTBROOK-WALNUT GROVE SCHOOLS","Westbrook-Walnut Grove Schools",0,17,6,"Cottonwood Co"]
["A","15-16",181,1,"BRAINERD PUBLIC SCHOOL DISTRICT","Brainerd Public School District",0,18,5,"Crow Wing Co"]
["A","15-16",182,1,"CROSBY-IRONTON PUBLIC SCHOOL DIST.","Crosby-Ironton Public School Dist.",0,18,5,"Crow Wing Co"]
["A","15-16",186,1,"PEQUOT LAKES PUBLIC SCHOOLS",{"$f":"PROPER(E67)","v":"Pequot Lakes Public Schools"},0,18,5,"Crow Wing Co"]
["A","15-16",6,3,"SOUTH ST. PAUL PUBLIC SCHOOL DIST.","South St. Paul Public School Dist.",0,19,11,"Dakota Co"]
["A","15-16",191,1,"BURNSVILLE PUBLIC SCHOOL DISTRICT","Burnsville Public School District",0,19,11,"Dakota Co"]
["A","15-16",192,1,"FARMINGTON PUBLIC SCHOOL DISTRICT","Farmington Public School District",0,19,11,"Dakota Co"]
["A","15-16",194,1,"LAKEVILLE PUBLIC SCHOOL DISTRICT","Lakeville Public School District",0,19,11,"Dakota Co"]
["A","15-16",195,1,"RANDOLPH PUBLIC SCHOOL DISTRICT","Randolph Public School District",0,19,11,"Dakota Co"]
["A","15-16",196,1,"ROSEMOUNT-APPLE VALLEY-EAGAN","Rosemount-Apple Valley-Eagan",0,19,11,"Dakota Co"]
["A","15-16",197,1,"WEST ST. PAUL-MENDOTA HTS.-EAGAN","West St. Paul-Mendota Hts.-Eagan",0,19,11,"Dakota Co"]
["A","15-16",199,1,"INVER GROVE HEIGHTS SCHOOLS","Inver Grove Heights Schools",0,19,11,"Dakota Co"]
["A","15-16",200,1,"HASTINGS PUBLIC SCHOOL DISTRICT","Hastings Public School District",0,19,11,"Dakota Co"]
["A","15-16",203,1,"HAYFIELD PUBLIC SCHOOL DISTRICT","Hayfield Public School District",0,20,10,"Dodge Co"]
["A","15-16",204,1,"KASSON-MANTORVILLE SCHOOL DISTRICT","Kasson-Mantorville School District",0,20,10,"Dodge Co"]
["A","15-16",2125,1,"TRITON SCHOOL DISTRICT","Triton School District",0,20,10,"Dodge Co"]
["A","15-16",206,1,"ALEXANDRIA PUBLIC SCHOOL DISTRICT","Alexandria Public School District",0,21,4,"Douglas Co"]
["A","15-16",213,1,"OSAKIS PUBLIC SCHOOL DISTRICT","Osakis Public School District",0,21,4,"Douglas Co"]
["A","15-16",2908,1,"BRANDON-EVANSVILLE PUBLIC SCHOOLS","Brandon-Evansville Public Schools",0,21,4,"Douglas Co"]
["A","15-16",2134,1,"UNITED SOUTH CENTRAL SCHOOL DIST.","United South Central School Dist.",0,22,9,"Faribault Co"]
["A","15-16",2860,1,"BLUE EARTH AREA PUBLIC SCHOOL","Blue Earth Area Public School",0,22,9,"Faribault Co"]
["A","15-16",229,1,"LANESBORO PUBLIC SCHOOL DISTRICT","Lanesboro Public School District",0,23,10,"Fillmore Co"]
["A","15-16",238,1,"MABEL-CANTON PUBLIC SCHOOL DIST.","Mabel-Canton Public School Dist.",0,23,10,"Fillmore Co"]
["A","15-16",239,1,"RUSHFORD-PETERSON PUBLIC SCHOOLS","Rushford-Peterson Public Schools",0,23,10,"Fillmore Co"]
["A","15-16",2137,1,"KINGSLAND PUBLIC SCHOOL DISTRICT","Kingsland Public School District",0,23,10,"Fillmore Co"]
["A","15-16",2198,1,"FILLMORE CENTRAL","Fillmore Central",0,23,10,"Fillmore Co"]
["A","15-16",241,1,"ALBERT LEA PUBLIC SCHOOL DISTRICT","Albert Lea Public School District",0,24,10,"Freeborn Co"]
["A","15-16",242,1,"ALDEN-CONGER PUBLIC SCHOOL DISTRICT","Alden-Conger Public School District",0,24,10,"Freeborn Co"]
["A","15-16",2886,1,"GLENVILLE-EMMONS SCHOOL DISTRICT","Glenville-Emmons School District",0,24,10,"Freeborn Co"]
["A","15-16",252,1,"CANNON FALLS PUBLIC SCHOOL DISTRICT","Cannon Falls Public School District",0,25,10,"Goodhue Co"]
["A","15-16",253,1,"GOODHUE PUBLIC SCHOOL DISTRICT","Goodhue Public School District",0,25,10,"Goodhue Co"]
["A","15-16",255,1,"PINE ISLAND PUBLIC SCHOOL DIST.","Pine Island Public School Dist.",0,25,10,"Goodhue Co"]
["A","15-16",256,1,"RED WING PUBLIC SCHOOL DISTRICT","Red Wing Public School District",0,25,10,"Goodhue Co"]
["A","15-16",2172,1,"KENYON-WANAMINGO SCHOOL DISTRICT","Kenyon-Wanamingo School District",0,25,10,"Goodhue Co"]
["A","15-16",261,1,"ASHBY PUBLIC SCHOOL DISTRICT","Ashby Public School District",0,26,4,"Grant Co"]
["A","15-16",264,1,"HERMAN-NORCROSS SCHOOL DISTRICT","Herman-Norcross School District",0,26,4,"Grant Co"]
["A","15-16",2342,1,"WEST CENTRAL AREA","West Central Area",0,26,4,"Grant Co"]
["A","15-16",1.2,3,"MINNEAPOLIS PUBLIC SCHOOL DIST.","Minneapolis Public School Dist.",0,27,11,"Hennepin Co"]
["A","15-16",270,1,"HOPKINS PUBLIC SCHOOL DISTRICT","Hopkins Public School District",0,27,11,"Hennepin Co"]
["A","15-16",271,1,"BLOOMINGTON PUBLIC SCHOOL DISTRICT","Bloomington Public School District",0,27,11,"Hennepin Co"]
["A","15-16",272,1,"EDEN PRAIRIE PUBLIC SCHOOL DISTRICT","Eden Prairie Public School District",0,27,11,"Hennepin Co"]
["A","15-16",273,1,"EDINA PUBLIC SCHOOL DISTRICT","Edina Public School District",0,27,11,"Hennepin Co"]
["A","15-16",276,1,"MINNETONKA PUBLIC SCHOOL DISTRICT","Minnetonka Public School District",0,27,11,"Hennepin Co"]
["A","15-16",277,1,"WESTONKA PUBLIC SCHOOL DISTRICT","Westonka Public School District",0,27,11,"Hennepin Co"]
["A","15-16",278,1,"ORONO PUBLIC SCHOOL DISTRICT","Orono Public School District",0,27,11,"Hennepin Co"]
["A","15-16",279,1,"OSSEO PUBLIC SCHOOL DISTRICT","Osseo Public School District",0,27,11,"Hennepin Co"]
["A","15-16",280,1,"RICHFIELD PUBLIC SCHOOL DISTRICT","Richfield Public School District",0,27,11,"Hennepin Co"]
["A","15-16",281,1,"ROBBINSDALE PUBLIC SCHOOL DISTRICT","Robbinsdale Public School District",0,27,11,"Hennepin Co"]
["A","15-16",282,1,"ST. ANTHONY-NEW BRIGHTON SCHOOLS","St. Anthony-New Brighton Schools",0,27,11,"Hennepin Co"]
["A","15-16",283,1,"ST. LOUIS PARK PUBLIC SCHOOL DIST.","St. Louis Park Public School Dist.",0,27,11,"Hennepin Co"]
["A","15-16",284,1,"WAYZATA PUBLIC SCHOOL DISTRICT","Wayzata Public School District",0,27,11,"Hennepin Co"]
["A","15-16",286,1,"BROOKLYN CENTER SCHOOL DISTRICT","Brooklyn Center School District",0,27,11,"Hennepin Co"]
["A","15-16",294,1,"HOUSTON PUBLIC SCHOOL DISTRICT","Houston Public School District",0,28,10,"Houston Co"]
["A","15-16",297,1,"SPRING GROVE SCHOOL DISTRICT","Spring Grove School District",0,28,10,"Houston Co"]
["A","15-16",299,1,"CALEDONIA PUBLIC SCHOOL DISTRICT","Caledonia Public School District",0,28,10,"Houston Co"]
["A","15-16",300,1,"LA CRESCENT-HOKAH SCHOOL DISTRICT","La Crescent-Hokah School District",0,28,10,"Houston Co"]
["A","15-16",306,1,"LAPORTE PUBLIC SCHOOL DISTRICT","Laporte Public School District",0,29,1,"Hubbard Co"]
["A","15-16",308,1,"NEVIS PUBLIC SCHOOL DISTRICT","Nevis Public School District",0,29,1,"Hubbard Co"]
["A","15-16",309,1,"PARK RAPIDS PUBLIC SCHOOL DISTRICT","Park Rapids Public School District",0,29,1,"Hubbard Co"]
["A","15-16",314,1,"BRAHAM PUBLIC SCHOOL DISTRICT","Braham Public School District",0,30,7,"Isanti Co"]
["A","15-16",911,1,"CAMBRIDGE-ISANTI PUBLIC SCHOOL DIST","Cambridge-Isanti Public School Dist",0,30,7,"Isanti Co"]
["A","15-16",316,1,"GREENWAY PUBLIC SCHOOL DISTRICT","Greenway Public School District",0,31,3,"Itasca Co"]
["A","15-16",317,1,"DEER RIVER PUBLIC SCHOOL DISTRICT","Deer River Public School District",0,31,3,"Itasca Co"]
["A","15-16",318,1,"GRAND RAPIDS PUBLIC SCHOOL DISTRICT","Grand Rapids Public School District",0,31,3,"Itasca Co"]
["A","15-16",319,1,"NASHWAUK-KEEWATIN SCHOOL DISTRICT","Nashwauk-Keewatin School District",0,31,3,"Itasca Co"]
["A","15-16",330,1,"HERON LAKE-OKABENA SCHOOL DISTRICT","Heron Lake-Okabena School District",0,32,6,"Jackson Co"]
["A","15-16",2895,1,"JACKSON COUNTY CENTRAL SCHOOL DIST.","Jackson County Central School Dist.",0,32,6,"Jackson Co"]
["A","15-16",332,1,"MORA PUBLIC SCHOOL DISTRICT",{"$f":"PROPER(E131)","v":"Mora Public School District"},0,33,7,"Kanabec Co"]
["A","15-16",333,1,"OGILVIE PUBLIC SCHOOL DISTRICT","Ogilvie Public School District",0,33,7,"Kanabec Co"]
["A","15-16",345,1,"NEW LONDON-SPICER SCHOOL DISTRICT","New London-Spicer School District",0,34,6,"Kandiyohi Co"]
["A","15-16",347,1,"WILLMAR PUBLIC SCHOOL DISTRICT","Willmar Public School District",0,34,6,"Kandiyohi Co"]
["A","15-16",815,2,"PRINSBURG PUBLIC SCHOOL DISTRICT","Prinsburg Public School District",0,34,6,"Kandiyohi Co"]
["A","15-16",356,1,"LANCASTER PUBLIC SCHOOL DISTRICT","Lancaster Public School District",0,35,1,"Kittson Co"]
["A","15-16",2171,1,"KITTSON CENTRAL SCHOOL DISTRICT","Kittson Central School District",0,35,1,"Kittson Co"]
["A","15-16",2358,1,"TRI-COUNTY SCHOOL DISTRICT","Tri-County School District",0,35,1,"Kittson Co"]
["A","15-16",361,1,"INTERNATIONAL FALLS SCHOOL DISTRICT","International Falls School District",0,36,3,"Koochiching Co"]
["A","15-16",362,1,"LITTLEFORK-BIG FALLS SCHOOL DIST.","Littlefork-Big Falls School Dist.",0,36,3,"Koochiching Co"]
["A","15-16",363,1,"SOUTH KOOCHICHING SCHOOL DISTRICT","South Koochiching School District",0,36,1,"Koochiching Co"]
["A","15-16",378,1,"DAWSON-BOYD PUBLIC SCHOOL DISTRICT","Dawson-Boyd Public School District",0,37,6,"Lac Qui Parle Co"]
["A","15-16",2853,1,"LAC QUI PARLE VALLEY SCHOOL DIST.","Lac Qui Parle Valley School Dist.",0,37,6,"Lac Qui Parle Co"]
["A","15-16",381,1,"LAKE SUPERIOR PUBLIC SCHOOL DIST.","Lake Superior Public School Dist.",0,38,3,"Lake Co"]
["A","15-16",390,1,"LAKE OF THE WOODS SCHOOL DISTRICT","Lake Of The Woods School District",0,39,1,"Lake of Woods Co"]
["A","15-16",391,1,"CLEVELAND PUBLIC SCHOOL DISTRICT","Cleveland Public School District",0,40,9,"Le Sueur Co"]
["A","15-16",2143,1,"WATERVILLE-ELYSIAN-MORRISTOWN","Waterville-Elysian-Morristown",0,40,9,"Le Sueur Co"]
["A","15-16",2397,1,"LE SUEUR-HENDERSON SCHOOL DISTRICT","Le Sueur-Henderson School District",0,40,9,"Le Sueur Co"]
["A","15-16",2905,1,"TRI-CITY UNITED SCHOOL DISTRICT","Tri-City United School District",0,40,9,"Le Sueur Co"]
["A","15-16",402,1,"HENDRICKS PUBLIC SCHOOL DISTRICT","Hendricks Public School District",0,41,6,"Lincoln Co"]
["A","15-16",403,1,"IVANHOE PUBLIC SCHOOL DISTRICT","Ivanhoe Public School District",0,41,6,"Lincoln Co"]
["A","15-16",404,1,"LAKE BENTON PUBLIC SCHOOL DISTRICT","Lake Benton Public School District",0,41,6,"Lincoln Co"]
["A","15-16",2902,1,"RTR PUBLIC SCHOOLS","Rtr Public Schools",0,41,6,"Lincoln Co"]
["A","15-16",413,1,"MARSHALL PUBLIC SCHOOL DISTRICT","Marshall Public School District",0,42,6,"Lyon Co"]
["A","15-16",414,1,"MINNEOTA PUBLIC SCHOOL DISTRICT","Minneota Public School District",0,42,6,"Lyon Co"]
["A","15-16",415,1,"LYND PUBLIC SCHOOL DISTRICT","Lynd Public School District",0,42,6,"Lyon Co"]
["A","15-16",2167,1,"LAKEVIEW SCHOOL DISTRICT","Lakeview School District",0,42,6,"Lyon Co"]
["A","15-16",2904,1,"TRACY AREA PUBLIC SCHOOL DISTRICT","Tracy Area Public School District",0,42,6,"Lyon Co"]
["A","15-16",432,1,"MAHNOMEN PUBLIC SCHOOL DISTRICT","Mahnomen Public School District",0,44,1,"Mahnomen Co"]
["A","15-16",435,1,"WAUBUN-OGEMA-WHITE EARTH PUBLIC SCH","Waubun-Ogema-White Earth Public Sch",0,44,1,"Mahnomen Co"]
["A","15-16",441,1,"MARSHALL COUNTY CENTRAL SCHOOLS","Marshall County Central Schools",0,45,1,"Marshall Co"]
["A","15-16",447,1,"GRYGLA PUBLIC SCHOOL DISTRICT","Grygla Public School District",0,45,1,"Marshall Co"]
["A","15-16",2176,1,"WARREN-ALVARADO-OSLO SCHOOL DIST.","Warren-Alvarado-Oslo School Dist.",0,45,1,"Marshall Co"]
["A","15-16",2856,1,"STEPHEN-ARGYLE CENTRAL SCHOOLS","Stephen-Argyle Central Schools",0,45,1,"Marshall Co"]
["A","15-16",458,1,"TRUMAN PUBLIC SCHOOL DISTRICT","Truman Public School District",0,46,9,"Martin Co"]
["A","15-16",2448,1,"MARTIN COUNTY WEST SCHOOL DISTRICT","Martin County West School District",0,46,9,"Martin Co"]
["A","15-16",2536,1,"GRANADA HUNTLEY-EAST CHAIN","Granada Huntley-East Chain",0,46,9,"Martin Co"]
["A","15-16",2752,1,"FAIRMONT AREA SCHOOL DISTRICT","Fairmont Area School District",0,46,9,"Martin Co"]
["A","15-16",423,1,"HUTCHINSON PUBLIC SCHOOL DISTRICT","Hutchinson Public School District",0,43,6,"Mc Leod Co"]
["A","15-16",424,1,"LESTER PRAIRIE PUBLIC SCHOOL DIST.","Lester Prairie Public School Dist.",0,43,6,"Mc Leod Co"]
["A","15-16",2859,1,"GLENCOE-SILVER LAKE SCHOOL DISTRICT","Glencoe-Silver Lake School District",0,43,6,"Mc Leod Co"]
["A","15-16",463,1,"EDEN VALLEY-WATKINS SCHOOL DISTRICT","Eden Valley-Watkins School District",0,47,6,"Meeker Co"]
["A","15-16",465,1,"LITCHFIELD PUBLIC SCHOOL DISTRICT","Litchfield Public School District",0,47,6,"Meeker Co"]
["A","15-16",2396,1,"A.C.G.C. PUBLIC SCHOOL DISTRICT","A.C.G.C. Public School District",0,47,6,"Meeker Co"]
["A","15-16",473,1,"ISLE PUBLIC SCHOOL DISTRICT","Isle Public School District",0,48,7,"Mille Lacs Co"]
["A","15-16",477,1,"PRINCETON PUBLIC SCHOOL DISTRICT","Princeton Public School District",0,48,7,"Mille Lacs Co"]
["A","15-16",480,1,"ONAMIA PUBLIC SCHOOL DISTRICT","Onamia Public School District",0,48,7,"Mille Lacs Co"]
["A","15-16",912,1,"MILACA PUBLIC SCHOOL DISTRICT","Milaca Public School District",0,48,7,"Mille Lacs Co"]
["A","15-16",482,1,"LITTLE FALLS PUBLIC SCHOOL DISTRICT","Little Falls Public School District",0,49,5,"Morrison Co"]
["A","15-16",484,1,"PIERZ PUBLIC SCHOOL DISTRICT","Pierz Public School District",0,49,5,"Morrison Co"]
["A","15-16",485,1,"ROYALTON PUBLIC SCHOOL DISTRICT","Royalton Public School District",0,49,5,"Morrison Co"]
["A","15-16",486,1,"SWANVILLE PUBLIC SCHOOL DISTRICT","Swanville Public School District",0,49,5,"Morrison Co"]
["A","15-16",487,1,"UPSALA PUBLIC SCHOOL DISTRICT","Upsala Public School District",0,49,5,"Morrison Co"]
["A","15-16",492,1,"AUSTIN PUBLIC SCHOOL DISTRICT","Austin Public School District",0,50,10,"Mower Co"]
["A","15-16",495,1,"GRAND MEADOW PUBLIC SCHOOL DISTRICT","Grand Meadow Public School District",0,50,10,"Mower Co"]
["A","15-16",497,1,"LYLE PUBLIC SCHOOL DISTRICT","Lyle Public School District",0,50,10,"Mower Co"]
["A","15-16",499,1,"LEROY-OSTRANDER PUBLIC SCHOOLS","Leroy-Ostrander Public Schools",0,50,10,"Mower Co"]
["A","15-16",500,1,"SOUTHLAND PUBLIC SCHOOL DISTRICT","Southland Public School District",0,50,10,"Mower Co"]
["A","15-16",505,1,"FULDA PUBLIC SCHOOL DISTRICT","Fulda Public School District",0,51,6,"Murray Co"]
["A","15-16",2169,1,"MURRAY COUNTY CENTRAL SCHOOL DIST.","Murray County Central School Dist.",0,51,6,"Murray Co"]
["A","15-16",507,1,"NICOLLET PUBLIC SCHOOL DISTRICT","Nicollet Public School District",0,52,9,"Nicollet Co"]
["A","15-16",508,1,"ST. PETER PUBLIC SCHOOL DISTRICT","St. Peter Public School District",0,52,9,"Nicollet Co"]
["A","15-16",511,1,"ADRIAN PUBLIC SCHOOL DISTRICT","Adrian Public School District",0,53,6,"Nobles Co"]
["A","15-16",514,1,"ELLSWORTH PUBLIC SCHOOL DISTRICT","Ellsworth Public School District",0,53,6,"Nobles Co"]
["A","15-16",518,1,"WORTHINGTON PUBLIC SCHOOL DISTRICT",{"$f":"PROPER(E195)","v":"Worthington Public School District"},0,53,6,"Nobles Co"]
["A","15-16",2907,1,"ROUND LAKE-BREWSTER PUBLIC SCHOOLS","Round Lake-Brewster Public Schools",0,53,6,"Nobles Co"]
["A","15-16",2215,1,"NORMAN COUNTY EAST SCHOOL DISTRICT","Norman County East School District",0,54,1,"Norman Co"]
["A","15-16",2527,1,"NORMAN COUNTY WEST SCHOOL DISTRICT","Norman County West School District",0,54,1,"Norman Co"]
["A","15-16",2854,1,"ADA-BORUP PUBLIC SCHOOL DISTRICT","Ada-Borup Public School District",0,54,1,"Norman Co"]
["A","15-16",227,1,"CHATFIELD PUBLIC SCHOOLS","Chatfield Public Schools",0,55,10,"Olmsted Co"]
["A","15-16",531,1,"BYRON PUBLIC SCHOOL DISTRICT","Byron Public School District",0,55,10,"Olmsted Co"]
["A","15-16",533,1,"DOVER-EYOTA PUBLIC SCHOOL DISTRICT","Dover-Eyota Public School District",0,55,10,"Olmsted Co"]
["A","15-16",534,1,"STEWARTVILLE PUBLIC SCHOOL DISTRICT","Stewartville Public School District",0,55,10,"Olmsted Co"]
["A","15-16",535,1,"ROCHESTER PUBLIC SCHOOL DISTRICT","Rochester Public School District",0,55,10,"Olmsted Co"]
["A","15-16",542,1,"BATTLE LAKE PUBLIC SCHOOL DISTRICT","Battle Lake Public School District",0,56,4,"Ottertail Co"]
["A","15-16",544,1,"FERGUS FALLS PUBLIC SCHOOL DISTRICT","Fergus Falls Public School District",0,56,4,"Ottertail Co"]
["A","15-16",545,1,"HENNING PUBLIC SCHOOL DISTRICT","Henning Public School District",0,56,4,"Ottertail Co"]
["A","15-16",547,1,"PARKERS PRAIRIE PUBLIC SCHOOL DIST.","Parkers Prairie Public School Dist.",0,56,4,"Ottertail Co"]
["A","15-16",548,1,"PELICAN RAPIDS PUBLIC SCHOOL DIST.","Pelican Rapids Public School Dist.",0,56,4,"Ottertail Co"]
["A","15-16",549,1,"PERHAM-DENT PUBLIC SCHOOL DISTRICT","Perham-Dent Public School District",0,56,4,"Ottertail Co"]
["A","15-16",550,1,"UNDERWOOD PUBLIC SCHOOL DISTRICT","Underwood Public School District",0,56,4,"Ottertail Co"]
["A","15-16",553,1,"NEW YORK MILLS PUBLIC SCHOOL DIST.","New York Mills Public School Dist.",0,56,4,"Ottertail Co"]
["A","15-16",561,1,"GOODRIDGE PUBLIC SCHOOL DISTRICT","Goodridge Public School District",0,57,1,"Pennington Co"]
["A","15-16",564,1,"THIEF RIVER FALLS SCHOOL DISTRICT","Thief River Falls School District",0,57,1,"Pennington Co"]
["A","15-16",577,1,"WILLOW RIVER PUBLIC SCHOOL DISTRICT","Willow River Public School District",0,58,7,"Pine Co"]
["A","15-16",578,1,"PINE CITY PUBLIC SCHOOL DISTRICT","Pine City Public School District",0,58,7,"Pine Co"]
["A","15-16",2165,1,"HINCKLEY-FINLAYSON SCHOOL DISTRICT","Hinckley-Finlayson School District",0,58,7,"Pine Co"]
["A","15-16",2580,1,"EAST CENTRAL SCHOOL DISTRICT","East Central School District",0,58,7,"Pine Co"]
["A","15-16",581,1,"EDGERTON PUBLIC SCHOOL DISTRICT","Edgerton Public School District",0,59,6,"Pipestone Co"]
["A","15-16",2689,1,"PIPESTONE AREA SCHOOL DISTRICT","Pipestone Area School District",0,59,6,"Pipestone Co"]
["A","15-16",592,1,"CLIMAX-SHELLY PUBLIC SCHOOLS","Climax-Shelly Public Schools",0,60,1,"Polk Co"]
["A","15-16",593,1,"CROOKSTON PUBLIC SCHOOL DISTRICT","Crookston Public School District",0,60,1,"Polk Co"]
["A","15-16",595,1,"EAST GRAND FORKS PUBLIC SCHOOL DIST","East Grand Forks Public School Dist",0,60,1,"Polk Co"]
["A","15-16",599,1,"FERTILE-BELTRAMI SCHOOL DISTRICT","Fertile-Beltrami School District",0,60,1,"Polk Co"]
["A","15-16",600,1,"FISHER PUBLIC SCHOOL DISTRICT","Fisher Public School District",0,60,1,"Polk Co"]
["A","15-16",601,1,"FOSSTON PUBLIC SCHOOL DISTRICT","Fosston Public School District",0,60,1,"Polk Co"]
["A","15-16",2609,1,"WIN-E-MAC SCHOOL DISTRICT","Win-E-Mac School District",0,60,1,"Polk Co"]
["A","15-16",2149,1,"MINNEWASKA SCHOOL DISTRICT","Minnewaska School District",0,61,4,"Pope Co"]
["A","15-16",621,1,"MOUNDS VIEW PUBLIC SCHOOL DISTRICT","Mounds View Public School District",0,62,11,"Ramsey Co"]
["A","15-16",622,1,"NORTH ST PAUL-MAPLEWOOD OAKDALE DIS","North St Paul-Maplewood Oakdale Dis",0,62,11,"Ramsey Co"]
["A","15-16",623,1,"ROSEVILLE PUBLIC SCHOOL DISTRICT","Roseville Public School District",0,62,11,"Ramsey Co"]
["A","15-16",624,1,"WHITE BEAR LAKE SCHOOL DISTRICT","White Bear Lake School District",0,62,11,"Ramsey Co"]
["A","15-16",625,1,"ST. PAUL PUBLIC SCHOOL DISTRICT","St. Paul Public School District",0,62,11,"Ramsey Co"]
["A","15-16",630,1,"RED LAKE FALLS PUBLIC SCHOOL DIST.","Red Lake Falls Public School Dist.",0,63,1,"Red Lake Co"]
["A","15-16",2906,1,"RED LAKE COUNTY CENTRAL PUBLIC SCH","Red Lake County Central Public Sch",0,63,1,"Red Lake Co"]
["A","15-16",635,1,"MILROY PUBLIC SCHOOL DISTRICT","Milroy Public School District",0,64,6,"Redwood Co"]
["A","15-16",640,1,"WABASSO PUBLIC SCHOOL DISTRICT","Wabasso Public School District",0,64,6,"Redwood Co"]
["A","15-16",2754,1,"CEDAR MOUNTAIN SCHOOL DISTRICT","Cedar Mountain School District",0,64,6,"Redwood Co"]
["A","15-16",2897,1,"REDWOOD AREA SCHOOL DISTRICT","Redwood Area School District",0,64,6,"Redwood Co"]
["A","15-16",2159,1,"BUFFALO LK-HECTOR-STEWART PUBLIC SC","Buffalo Lk-Hector-Stewart Public Sc",0,65,6,"Renville Co"]
["A","15-16",2534,1,"BIRD ISLAND-OLIVIA-LAKE LILLIAN","Bird Island-Olivia-Lake Lillian",0,65,6,"Renville Co"]
["A","15-16",2890,1,"RENVILLE COUNTY WEST SCHOOL DIST.","Renville County West School Dist.",0,65,6,"Renville Co"]
["A","15-16",656,1,"FARIBAULT PUBLIC SCHOOL DISTRICT","Faribault Public School District",0,66,10,"Rice Co"]
["A","15-16",659,1,"NORTHFIELD PUBLIC SCHOOL DISTRICT","Northfield Public School District",0,66,10,"Rice Co"]
["A","15-16",671,1,"HILLS-BEAVER CREEK SCHOOL DISTRICT","Hills-Beaver Creek School District",0,67,6,"Rock Co"]
["A","15-16",2184,1,"LUVERNE PUBLIC SCHOOL DISTRICT","Luverne Public School District",0,67,6,"Rock Co"]
["A","15-16",676,1,"BADGER PUBLIC SCHOOL DISTRICT","Badger Public School District",0,68,1,"Roseau Co"]
["A","15-16",682,1,"ROSEAU PUBLIC SCHOOL DISTRICT","Roseau Public School District",0,68,1,"Roseau Co"]
["A","15-16",690,1,"WARROAD PUBLIC SCHOOL DISTRICT","Warroad Public School District",0,68,1,"Roseau Co"]
["A","15-16",2683,1,"GREENBUSH-MIDDLE RIVER SCHOOL DIST.","Greenbush-Middle River School Dist.",0,68,1,"Roseau Co"]
["A","15-16",716,1,"BELLE PLAINE PUBLIC SCHOOL DISTRICT","Belle Plaine Public School District",0,70,11,"Scott Co"]
["A","15-16",717,1,"JORDAN PUBLIC SCHOOL DISTRICT","Jordan Public School District",0,70,11,"Scott Co"]
["A","15-16",719,1,"PRIOR LAKE-SAVAGE AREA SCHOOLS","Prior Lake-Savage Area Schools",0,70,11,"Scott Co"]
["A","15-16",720,1,"SHAKOPEE PUBLIC SCHOOL DISTRICT","Shakopee Public School District",0,70,11,"Scott Co"]
["A","15-16",721,1,"NEW PRAGUE AREA SCHOOLS","New Prague Area Schools",0,70,11,"Scott Co"]
["A","15-16",726,1,"BECKER PUBLIC SCHOOL DISTRICT","Becker Public School District",0,71,7,"Sherburne Co"]
["A","15-16",727,1,"BIG LAKE PUBLIC SCHOOL DISTRICT","Big Lake Public School District",0,71,7,"Sherburne Co"]
["A","15-16",728,1,"ELK RIVER PUBLIC SCHOOL DISTRICT","Elk River Public School District",0,71,7,"Sherburne Co"]
["A","15-16",2310,1,"SIBLEY EAST SCHOOL DISTRICT",{"$f":"PROPER(E259)","v":"Sibley East School District"},0,72,9,"Sibley Co"]
["A","15-16",2365,1,"G.F.W.","G.F.W.",0,72,9,"Sibley Co"]
["A","15-16",695,1,"CHISHOLM PUBLIC SCHOOL DISTRICT","Chisholm Public School District",0,69,3,"St Louis Co"]
["A","15-16",696,1,"ELY PUBLIC SCHOOL DISTRICT","Ely Public School District",0,69,3,"St Louis Co"]
["A","15-16",698,1,"FLOODWOOD PUBLIC SCHOOL DISTRICT","Floodwood Public School District",0,69,3,"St Louis Co"]
["A","15-16",700,1,"HERMANTOWN PUBLIC SCHOOL DISTRICT","Hermantown Public School District",0,69,3,"St Louis Co"]
["A","15-16",701,1,"HIBBING PUBLIC SCHOOL DISTRICT","Hibbing Public School District",0,69,3,"St Louis Co"]
["A","15-16",704,1,"PROCTOR PUBLIC SCHOOL DISTRICT","Proctor Public School District",0,69,3,"St Louis Co"]
["A","15-16",706,1,"VIRGINIA PUBLIC SCHOOL DISTRICT","Virginia Public School District",0,69,3,"St Louis Co"]
["A","15-16",707,1,"NETT LAKE PUBLIC SCHOOL DISTRICT","Nett Lake Public School District",0,69,3,"St Louis Co"]
["A","15-16",709,1,"DULUTH PUBLIC SCHOOL DISTRICT","Duluth Public School District",0,69,3,"St Louis Co"]
["A","15-16",712,1,"MOUNTAIN IRON-BUHL SCHOOL DISTRICT","Mountain Iron-Buhl School District",0,69,3,"St Louis Co"]
["A","15-16",2142,1,"ST. LOUIS COUNTY SCHOOL DISTRICT","St. Louis County School District",0,69,3,"St Louis Co"]
["A","15-16",2154,1,"EVELETH-GILBERT SCHOOL DISTRICT","Eveleth-Gilbert School District",0,69,3,"St Louis Co"]
["A","15-16",2711,1,"MESABI EAST SCHOOL DISTRICT","Mesabi East School District",0,69,3,"St Louis Co"]
["A","15-16",738,1,"HOLDINGFORD PUBLIC SCHOOL DISTRICT","Holdingford Public School District",0,73,7,"Stearns Co"]
["A","15-16",739,1,"KIMBALL PUBLIC SCHOOL DISTRICT","Kimball Public School District",0,73,7,"Stearns Co"]
["A","15-16",740,1,"MELROSE PUBLIC SCHOOL DISTRICT","Melrose Public School District",0,73,7,"Stearns Co"]
["A","15-16",741,1,"PAYNESVILLE PUBLIC SCHOOL DISTRICT","Paynesville Public School District",0,73,7,"Stearns Co"]
["A","15-16",742,1,"ST. CLOUD PUBLIC SCHOOL DISTRICT","St. Cloud Public School District",0,73,7,"Stearns Co"]
["A","15-16",743,1,"SAUK CENTRE PUBLIC SCHOOL DISTRICT","Sauk Centre Public School District",0,73,7,"Stearns Co"]
["A","15-16",745,1,"ALBANY PUBLIC SCHOOL DISTRICT","Albany Public School District",0,73,7,"Stearns Co"]
["A","15-16",748,1,"SARTELL-ST. STEPHEN SCHOOL DISTRICT","Sartell-St. Stephen School District",0,73,7,"Stearns Co"]
["A","15-16",750,1,"ROCORI PUBLIC SCHOOL DISTRICT","Rocori Public School District",0,73,7,"Stearns Co"]
["A","15-16",2364,1,"BELGRADE-BROOTEN-ELROSA SCHOOL DIST","Belgrade-Brooten-Elrosa School Dist",0,73,7,"Stearns Co"]
["A","15-16",756,1,"BLOOMING PRAIRIE PUBLIC SCHOOL DIST","Blooming Prairie Public School Dist",0,74,10,"Steele Co"]
["A","15-16",761,1,"OWATONNA PUBLIC SCHOOL DISTRICT","Owatonna Public School District",0,74,10,"Steele Co"]
["A","15-16",763,1,"MEDFORD PUBLIC SCHOOL DISTRICT","Medford Public School District",0,74,10,"Steele Co"]
["A","15-16",768,1,"HANCOCK PUBLIC SCHOOL DISTRICT","Hancock Public School District",0,75,4,"Stevens Co"]
["A","15-16",771,1,"CHOKIO-ALBERTA PUBLIC SCHOOL DIST.","Chokio-Alberta Public School Dist.",0,75,4,"Stevens Co"]
["A","15-16",2769,1,"MORRIS AREA PUBLIC SCHOOLS","Morris Area Public Schools",0,75,4,"Stevens Co"]
["A","15-16",775,1,"KERKHOVEN-MURDOCK-SUNBURG","Kerkhoven-Murdock-Sunburg",0,76,6,"Swift Co"]
["A","15-16",777,1,"BENSON PUBLIC SCHOOL DISTRICT","Benson Public School District",0,76,6,"Swift Co"]
["A","15-16",786,1,"BERTHA-HEWITT PUBLIC SCHOOL DIST.","Bertha-Hewitt Public School Dist.",0,77,5,"Todd Co"]
["A","15-16",787,1,"BROWERVILLE PUBLIC SCHOOL DISTRICT","Browerville Public School District",0,77,5,"Todd Co"]
["A","15-16",2170,1,"STAPLES-MOTLEY SCHOOL DISTRICT","Staples-Motley School District",0,77,5,"Todd Co"]
["A","15-16",2753,1,"LONG PRAIRIE-GREY EAGLE SCHOOL DIST","Long Prairie-Grey Eagle School Dist",0,77,5,"Todd Co"]
["A","15-16",2759,1,"EAGLE VALLEY PUBLIC SCHOOL DISTRICT","Eagle Valley Public School District",0,77,5,"Todd Co"]
["A","15-16",801,1,"BROWNS VALLEY PUBLIC SCHOOL DIST.","Browns Valley Public School Dist.",0,78,4,"Traverse Co"]
["A","15-16",803,1,"WHEATON AREA PUBLIC SCHOOL DISTRICT","Wheaton Area Public School District",0,78,4,"Traverse Co"]
["A","15-16",811,1,"WABASHA-KELLOGG PUBLIC SCHOOL DIST.","Wabasha-Kellogg Public School Dist.",0,79,10,"Wabasha Co"]
["A","15-16",813,1,"LAKE CITY PUBLIC SCHOOL DISTRICT","Lake City Public School District",0,79,10,"Wabasha Co"]
["A","15-16",2805,1,"ZUMBROTA-MAZEPPA SCHOOL DISTRICT","Zumbrota-Mazeppa School District",0,79,10,"Wabasha Co"]
["A","15-16",2899,1,"PLAINVIEW-ELGIN-MILLVILLE","Plainview-Elgin-Millville",0,79,10,"Wabasha Co"]
["A","15-16",818,1,"VERNDALE PUBLIC SCHOOL DISTRICT","Verndale Public School District",0,80,5,"Wadena Co"]
["A","15-16",820,1,"SEBEKA PUBLIC SCHOOL DISTRICT","Sebeka Public School District",0,80,5,"Wadena Co"]
["A","15-16",821,1,"MENAHGA PUBLIC SCHOOL DISTRICT","Menahga Public School District",0,80,5,"Wadena Co"]
["A","15-16",2155,1,"WADENA-DEER CREEK SCHOOL DISTRICT","Wadena-Deer Creek School District",0,80,5,"Wadena Co"]
["A","15-16",829,1,"WASECA PUBLIC SCHOOL DISTRICT","Waseca Public School District",0,81,9,"Waseca Co"]
["A","15-16",2168,1,"NRHEG SCHOOL DISTRICT","Nrheg School District",0,81,9,"Waseca Co"]
["A","15-16",2835,1,"JANESVILLE-WALDORF-PEMBERTON","Janesville-Waldorf-Pemberton",0,81,9,"Waseca Co"]
["A","15-16",831,1,"FOREST LAKE PUBLIC SCHOOL DISTRICT","Forest Lake Public School District",0,82,11,"Washington Co"]
["A","15-16",832,1,"MAHTOMEDI PUBLIC SCHOOL DISTRICT","Mahtomedi Public School District",0,82,11,"Washington Co"]
["A","15-16",833,1,"SOUTH WASHINGTON COUNTY SCHOOL DIST","South Washington County School Dist",0,82,11,"Washington Co"]
["A","15-16",834,1,"STILLWATER AREA PUBLIC SCHOOL DIST.","Stillwater Area Public School Dist.",0,82,11,"Washington Co"]
["A","15-16",836,1,"BUTTERFIELD PUBLIC SCHOOL DISTRICT","Butterfield Public School District",0,83,9,"Watonwan Co"]
["A","15-16",837,1,"MADELIA PUBLIC SCHOOL DISTRICT","Madelia Public School District",0,83,9,"Watonwan Co"]
["A","15-16",840,1,"ST. JAMES PUBLIC SCHOOL DISTRICT","St. James Public School District",0,83,9,"Watonwan Co"]
["A","15-16",846,1,"BRECKENRIDGE PUBLIC SCHOOL DISTRICT","Breckenridge Public School District",0,84,4,"Wilkin Co"]
["A","15-16",850,1,"ROTHSAY PUBLIC SCHOOL DISTRICT","Rothsay Public School District",0,84,4,"Wilkin Co"]
["A","15-16",852,1,"CAMPBELL-TINTAH PUBLIC SCHOOL DIST.","Campbell-Tintah Public School Dist.",0,84,4,"Wilkin Co"]
["A","15-16",857,1,"LEWISTON-ALTURA PUBLIC SCHOOL DIST.","Lewiston-Altura Public School Dist.",0,85,10,"Winona Co"]
["A","15-16",858,1,"ST. CHARLES PUBLIC SCHOOL DISTRICT","St. Charles Public School District",0,85,10,"Winona Co"]
["A","15-16",861,1,"WINONA AREA PUBLIC SCHOOL DISTRICT","Winona Area Public School District",0,85,10,"Winona Co"]
["A","15-16",466,1,"DASSEL-COKATO PUBLIC SCHOOL DIST.",{"$f":"PROPER(E323)","v":"Dassel-Cokato Public School Dist."},0,86,6,"Wright Co"]
["A","15-16",876,1,"ANNANDALE PUBLIC SCHOOL DISTRICT","Annandale Public School District",0,86,7,"Wright Co"]
["A","15-16",877,1,"BUFFALO-HANOVER-MONTROSE PUBLIC SCH","Buffalo-Hanover-Montrose Public Sch",0,86,7,"Wright Co"]
["A","15-16",879,1,"DELANO PUBLIC SCHOOL DISTRICT","Delano Public School District",0,86,7,"Wright Co"]
["A","15-16",881,1,"MAPLE LAKE PUBLIC SCHOOL DISTRICT","Maple Lake Public School District",0,86,7,"Wright Co"]
["A","15-16",882,1,"MONTICELLO PUBLIC SCHOOL DISTRICT","Monticello Public School District",0,86,7,"Wright Co"]
["A","15-16",883,1,"ROCKFORD PUBLIC SCHOOL DISTRICT","Rockford Public School District",0,86,7,"Wright Co"]
["A","15-16",885,1,"ST. MICHAEL-ALBERTVILLE SCHOOL DIST","St. Michael-Albertville School Dist",0,86,7,"Wright Co"]
["A","15-16",2687,1,"HOWARD LAKE-WAVERLY-WINSTED","Howard Lake-Waverly-Winsted",0,86,7,"Wright Co"]
["A","15-16",891,1,"CANBY PUBLIC SCHOOL DISTRICT","Canby Public School District",0,87,6,"Yellow Medicine Co"]
["A","15-16",2190,1,"YELLOW MEDICINE EAST","Yellow Medicine East",0,87,6,"Yellow Medicine Co"]